BDBM50448026 CHEMBL3115244
SMILES: CCCn1nc2ccc(cc2c1Cc1ccc(cc1)-c1ccccc1C(O)=O)C(=O)NC(CC)c1ccccc1
InChI Key: InChIKey=HXPLAMBXLGASEL-UHFFFAOYSA-N
Data: 3 EC50
Activity Spreadsheet -- Enzyme Inhibition Constant Data from BindingDB
Found 3 hits for monomerid = 50448026
Trg + Lig
Ki
nM
ΔG°
kcal/mole
IC50
nM
Kd
nM
EC50/IC50
nM
koff
s-1
kon
M-1s-1
pHTemp
°C
Peroxisome proliferator-activated receptor delta
(Mus musculus)
BDBM50448026
(CHEMBL3115244)
Show SMILES CCCn1nc2ccc(cc2c1Cc1ccc(cc1)-c1ccccc1C(O)=O)C(=O)NC(CC)c1ccccc1
Show InChI InChI=1S/C34H33N3O3/c1-3-20-37-32(21-23-14-16-24(17-15-23)27-12-8-9-13-28(27)34(39)40)29-22-26(18-19-31(29)36-37)33(38)35-30(4-2)25-10-6-5-7-11-25/h5-19,22,30H,3-4,20-21H2,1-2H3,(H,35,38)(H,39,40)
Reactome pathway
n/an/an/an/a>1.00E+4n/an/an/an/a
GlaxoSmithKline R&D
Curated by ChEMBL
Assay Description
Agonist activity at mouse PPARdelta expressed in CV-1 cells by reporter gene assay
Bioorg Med Chem Lett 24: 1098-103 (2014)
Article DOI: 10.1016/j.bmcl.2014.01.004
BindingDB Entry DOI: 10.7270/Q2SQ91V1
Peroxisome proliferator-activated receptor gamma
(Mus musculus)
BDBM50448026
(CHEMBL3115244)
Show SMILES CCCn1nc2ccc(cc2c1Cc1ccc(cc1)-c1ccccc1C(O)=O)C(=O)NC(CC)c1ccccc1
Show InChI InChI=1S/C34H33N3O3/c1-3-20-37-32(21-23-14-16-24(17-15-23)27-12-8-9-13-28(27)34(39)40)29-22-26(18-19-31(29)36-37)33(38)35-30(4-2)25-10-6-5-7-11-25/h5-19,22,30H,3-4,20-21H2,1-2H3,(H,35,38)(H,39,40)
Reactome pathway
n/an/an/an/a 250n/an/an/an/a
GlaxoSmithKline R&D
Curated by ChEMBL
Assay Description
Partial agonist activity at mouse PPARgamma expressed in CV-1 cells by reporter gene assay
Bioorg Med Chem Lett 24: 1098-103 (2014)
Article DOI: 10.1016/j.bmcl.2014.01.004
BindingDB Entry DOI: 10.7270/Q2SQ91V1
Peroxisome proliferator-activated receptor alpha
(Mus musculus)
BDBM50448026
(CHEMBL3115244)
Show SMILES CCCn1nc2ccc(cc2c1Cc1ccc(cc1)-c1ccccc1C(O)=O)C(=O)NC(CC)c1ccccc1
Show InChI InChI=1S/C34H33N3O3/c1-3-20-37-32(21-23-14-16-24(17-15-23)27-12-8-9-13-28(27)34(39)40)29-22-26(18-19-31(29)36-37)33(38)35-30(4-2)25-10-6-5-7-11-25/h5-19,22,30H,3-4,20-21H2,1-2H3,(H,35,38)(H,39,40)
Reactome pathway
n/an/an/an/a>1.00E+4n/an/an/an/a
GlaxoSmithKline R&D
Curated by ChEMBL
Assay Description
Agonist activity at mouse PPARalpha expressed in CV-1 cells by reporter gene assay
Bioorg Med Chem Lett 24: 1098-103 (2014)
Article DOI: 10.1016/j.bmcl.2014.01.004
BindingDB Entry DOI: 10.7270/Q2SQ91V1