BDBM50448092 CHEMBL3121316
SMILES: COc1ncc(cc1NS(C)(=O)=O)-c1ccc2nc(N)n(-c3ccccc3)c(=O)c2c1
InChI Key: InChIKey=CVFBATDOQSKZOU-UHFFFAOYSA-N
Data: 2 IC50
Activity Spreadsheet -- Enzyme Inhibition Constant Data from BindingDB
Found 2 hits for monomerid = 50448092
Trg + Lig
Ki
nM
ΔG°
kcal/mole
IC50
nM
Kd
nM
EC50/IC50
nM
koff
s-1
kon
M-1s-1
pHTemp
°C
Phosphatidylinositol 4,5-bisphosphate 3-kinase catalytic subunit gamma isoform
(Homo sapiens (Human))
BDBM50448092
(CHEMBL3121316)
Show SMILES COc1ncc(cc1NS(C)(=O)=O)-c1ccc2nc(N)n(-c3ccccc3)c(=O)c2c1
Show InChI InChI=1S/C21H19N5O4S/c1-30-19-18(25-31(2,28)29)11-14(12-23-19)13-8-9-17-16(10-13)20(27)26(21(22)24-17)15-6-4-3-5-7-15/h3-12,25H,1-2H3,(H2,22,24)
NCI pathway
Reactome pathway
n/an/a 794n/an/an/an/an/an/a
GlaxoSmithKline
Curated by ChEMBL
Assay Description
Inhibition of PI3Kgamma (2 to 1102) (unknown origin) using diC8-PIP2 as substrate preincubated for 30 mins followed by substrate addition measured af...
J Med Chem 57: 2091-106 (2014)
Article DOI: 10.1021/jm400781h
BindingDB Entry DOI: 10.7270/Q2WH2RG0
Phosphatidylinositol 4-kinase alpha (PI4KA)
(Homo sapiens (Human))
BDBM50448092
(CHEMBL3121316)
Show SMILES COc1ncc(cc1NS(C)(=O)=O)-c1ccc2nc(N)n(-c3ccccc3)c(=O)c2c1
Show InChI InChI=1S/C21H19N5O4S/c1-30-19-18(25-31(2,28)29)11-14(12-23-19)13-8-9-17-16(10-13)20(27)26(21(22)24-17)15-6-4-3-5-7-15/h3-12,25H,1-2H3,(H2,22,24)
n/an/a 20n/an/an/an/an/an/a
GlaxoSmithKline
Curated by ChEMBL
Assay Description
Inhibition of GST-tagged PI4K-alpha (1 to 2044) (unknown origin) using D-myo-phosphatidylinositol as substrate preincubated for 30 mins followed by s...
J Med Chem 57: 2091-106 (2014)
Article DOI: 10.1021/jm400781h
BindingDB Entry DOI: 10.7270/Q2WH2RG0