null
SMILES: Fc1ccc(NC(=S)Nc2cccc(Cl)c2)cc1
InChI Key: InChIKey=ICJNFEMTSFWIKI-UHFFFAOYSA-N
Activity Spreadsheet -- Enzyme Inhibition Constant Data from BindingDB
Found 2 hits for monomerid = 50448179
Trg + Lig
Ki
nM
ΔG°
kcal/mole
IC50
nM
Kd
nM
EC50/IC50
nM
koff
s-1
kon
M-1s-1
pHTemp
°C
Urease
(Canavalia ensiformis (Jack bean) (Horse bean))
BDBM50448179
(CHEMBL1544729)
Show SMILES Fc1ccc(NC(=S)Nc2cccc(Cl)c2)cc1
Show InChI InChI=1S/C13H10ClFN2S/c14-9-2-1-3-12(8-9)17-13(18)16-11-6-4-10(15)5-7-11/h1-8H,(H2,16,17,18)
1.68E+4n/an/an/an/an/an/an/an/a
University Karachi
Curated by ChEMBL
Assay Description
Mixed-type inhibition of jack bean urease using urea as substrate assessed as ammonia production after 15 mins by Lineweaver-Burk/Dixon plot analysis
Eur J Med Chem 74: 314-23 (2014)
Article DOI: 10.1016/j.ejmech.2014.01.001
BindingDB Entry DOI: 10.7270/Q2VH5QBM
Urease
(Canavalia ensiformis (Jack bean) (Horse bean))
BDBM50448179
(CHEMBL1544729)
Show SMILES Fc1ccc(NC(=S)Nc2cccc(Cl)c2)cc1
Show InChI InChI=1S/C13H10ClFN2S/c14-9-2-1-3-12(8-9)17-13(18)16-11-6-4-10(15)5-7-11/h1-8H,(H2,16,17,18)
n/an/a 1.91E+4n/an/an/an/an/an/a
University Karachi
Curated by ChEMBL
Assay Description
Inhibition of jack bean urease using urea as substrate assessed as ammonia production after 15 mins by indophenol method
Eur J Med Chem 74: 314-23 (2014)
Article DOI: 10.1016/j.ejmech.2014.01.001
BindingDB Entry DOI: 10.7270/Q2VH5QBM