null
SMILES: OCC(=O)[C@H](CCc1ccccc1)NC(=O)[C@@H]1CCCC[C@@H]1NC(=O)OCc1ccccc1
InChI Key: InChIKey=ZQTRZEVHJUGKTF-VJBWXMMDSA-N
Activity Spreadsheet -- Enzyme Inhibition Constant Data from BindingDB
Found 2 hits for monomerid = 50448261
Trg + Lig
Ki
nM
ΔG°
kcal/mole
IC50
nM
Kd
nM
EC50/IC50
nM
koff
s-1
kon
M-1s-1
pHTemp
°C
Cysteine proteinase falcipain 2a
(Plasmodium falciparum)
BDBM50448261
(CHEMBL3120834)
Show SMILES OCC(=O)[C@H](CCc1ccccc1)NC(=O)[C@@H]1CCCC[C@@H]1NC(=O)OCc1ccccc1 |r|
Show InChI InChI=1S/C26H32N2O5/c29-17-24(30)23(16-15-19-9-3-1-4-10-19)27-25(31)21-13-7-8-14-22(21)28-26(32)33-18-20-11-5-2-6-12-20/h1-6,9-12,21-23,29H,7-8,13-18H2,(H,27,31)(H,28,32)/t21-,22+,23+/m1/s1
n/an/a 5.52E+3n/an/an/an/an/an/a
University of Mississippi
Curated by ChEMBL
Assay Description
Inhibition of Plasmodium falciparum cysteine protease falcipain-2
Bioorg Med Chem Lett 24: 1274-9 (2014)
Article DOI: 10.1016/j.bmcl.2014.01.062
BindingDB Entry DOI: 10.7270/Q26Q1ZRJ
Cysteine proteinase falcipain 3
(Plasmodium falciparum)
BDBM50448261
(CHEMBL3120834)
Show SMILES OCC(=O)[C@H](CCc1ccccc1)NC(=O)[C@@H]1CCCC[C@@H]1NC(=O)OCc1ccccc1 |r|
Show InChI InChI=1S/C26H32N2O5/c29-17-24(30)23(16-15-19-9-3-1-4-10-19)27-25(31)21-13-7-8-14-22(21)28-26(32)33-18-20-11-5-2-6-12-20/h1-6,9-12,21-23,29H,7-8,13-18H2,(H,27,31)(H,28,32)/t21-,22+,23+/m1/s1
n/an/a 540n/an/an/an/an/an/a
University of Mississippi
Curated by ChEMBL
Assay Description
Inhibition of Plasmodium falciparum cysteine protease falcipain-3
Bioorg Med Chem Lett 24: 1274-9 (2014)
Article DOI: 10.1016/j.bmcl.2014.01.062
BindingDB Entry DOI: 10.7270/Q26Q1ZRJ