BDBM50448466 CHEMBL3126374
SMILES: CC(C)c1cc(Cn2c(C)c(CCC(O)=O)c3ccccc23)ccc1O
InChI Key: InChIKey=UCFNGFLMPGVJJA-UHFFFAOYSA-N
Data: 2 IC50  2 EC50
Activity Spreadsheet -- Enzyme Inhibition Constant Data from BindingDB
Found 4 hits for monomerid = 50448466
Trg + Lig
Ki
nM
ΔG°
kcal/mole
IC50
nM
Kd
nM
EC50/IC50
nM
koff
s-1
kon
M-1s-1
pHTemp
°C
Thyroid hormone receptor beta
(Homo sapiens (Human))
BDBM50448466
(CHEMBL3126374)
Show SMILES CC(C)c1cc(Cn2c(C)c(CCC(O)=O)c3ccccc23)ccc1O
Show InChI InChI=1S/C22H25NO3/c1-14(2)19-12-16(8-10-21(19)24)13-23-15(3)17(9-11-22(25)26)18-6-4-5-7-20(18)23/h4-8,10,12,14,24H,9,11,13H2,1-3H3,(H,25,26)
NCI pathway
Reactome pathway
n/an/an/an/a 37n/an/an/an/a
Sanwa Kagaku Kenkyusho Co., Ltd
Curated by ChEMBL
Assay Description
Agonist activity at human recombinant TRbeta1 transfected in CV-1 cells after 8 to 10 hrs by alkaline phosphatase reporter gene assay
Bioorg Med Chem 22: 488-98 (2013)
Article DOI: 10.1016/j.bmc.2013.11.001
BindingDB Entry DOI: 10.7270/Q2H41SXN
Thyroid hormone receptor alpha
(Homo sapiens (Human))
BDBM50448466
(CHEMBL3126374)
Show SMILES CC(C)c1cc(Cn2c(C)c(CCC(O)=O)c3ccccc23)ccc1O
Show InChI InChI=1S/C22H25NO3/c1-14(2)19-12-16(8-10-21(19)24)13-23-15(3)17(9-11-22(25)26)18-6-4-5-7-20(18)23/h4-8,10,12,14,24H,9,11,13H2,1-3H3,(H,25,26)
NCI pathway
Reactome pathway
n/an/a 1.30E+3n/an/an/an/an/an/a
Sanwa Kagaku Kenkyusho Co., Ltd
Curated by ChEMBL
Assay Description
Displacement of [125I]-Triiodothyronine from human recombinant TRalpha1 ligand binding domain after 2 to 3 hrs by beta counting
Bioorg Med Chem 22: 488-98 (2013)
Article DOI: 10.1016/j.bmc.2013.11.001
BindingDB Entry DOI: 10.7270/Q2H41SXN
Thyroid hormone receptor beta
(Homo sapiens (Human))
BDBM50448466
(CHEMBL3126374)
Show SMILES CC(C)c1cc(Cn2c(C)c(CCC(O)=O)c3ccccc23)ccc1O
Show InChI InChI=1S/C22H25NO3/c1-14(2)19-12-16(8-10-21(19)24)13-23-15(3)17(9-11-22(25)26)18-6-4-5-7-20(18)23/h4-8,10,12,14,24H,9,11,13H2,1-3H3,(H,25,26)
NCI pathway
Reactome pathway
n/an/a 760n/an/an/an/an/an/a
Sanwa Kagaku Kenkyusho Co., Ltd
Curated by ChEMBL
Assay Description
Displacement of [125I]-Triiodothyronine from human recombinant TRbeta1 ligand binding domain after 2 to 3 hrs by beta counting
Bioorg Med Chem 22: 488-98 (2013)
Article DOI: 10.1016/j.bmc.2013.11.001
BindingDB Entry DOI: 10.7270/Q2H41SXN
Thyroid hormone receptor alpha
(Homo sapiens (Human))
BDBM50448466
(CHEMBL3126374)
Show SMILES CC(C)c1cc(Cn2c(C)c(CCC(O)=O)c3ccccc23)ccc1O
Show InChI InChI=1S/C22H25NO3/c1-14(2)19-12-16(8-10-21(19)24)13-23-15(3)17(9-11-22(25)26)18-6-4-5-7-20(18)23/h4-8,10,12,14,24H,9,11,13H2,1-3H3,(H,25,26)
NCI pathway
Reactome pathway
n/an/an/an/a 39n/an/an/an/a
Sanwa Kagaku Kenkyusho Co., Ltd
Curated by ChEMBL
Assay Description
Agonist activity at human recombinant TRalpha1 transfected in CV-1 cells after 8 to 10 hrs by alkaline phosphatase reporter gene assay
Bioorg Med Chem 22: 488-98 (2013)
Article DOI: 10.1016/j.bmc.2013.11.001
BindingDB Entry DOI: 10.7270/Q2H41SXN