BDBM50448706 CHEMBL3127854
SMILES: COc1nc([C@H]2CCCO2)c(s1)C(=O)N[C@H]1C2CC3CC1C[C@](O)(C3)C2
InChI Key: InChIKey=XCUHEQGKBQYLBY-MCMXVRIYSA-N
Data: 3 IC50
Activity Spreadsheet -- Enzyme Inhibition Constant Data from BindingDB
Found 3 hits for monomerid = 50448706
Trg + Lig
Ki
nM
ΔG°
kcal/mole
IC50
nM
Kd
nM
EC50/IC50
nM
koff
s-1
kon
M-1s-1
pHTemp
°C
11-beta-hydroxysteroid dehydrogenase 1
(Homo sapiens (Human))
BDBM50448706
(CHEMBL3127854)
Show SMILES COc1nc([C@H]2CCCO2)c(s1)C(=O)N[C@H]1C2CC3CC1C[C@](O)(C3)C2 |r,wU:22.25,wD:15.16,5.4,TLB:14:15:19:21.22.24,25:22:15.16.17:19,THB:25:16:19:21.22.24,24:22:15:17.18.19,24:18:15:21.25.22,23:22:15:17.18.19,23:22:15.16.17:19,(.87,-30.81,;2.03,-29.8,;3.48,-30.3,;3.94,-31.77,;5.48,-31.79,;6.36,-33.05,;5.87,-34.5,;7.1,-35.43,;8.36,-34.54,;7.91,-33.07,;5.97,-30.33,;4.74,-29.41,;7.31,-29.56,;7.3,-28.02,;8.64,-30.32,;9.97,-29.55,;11.47,-29.16,;11.5,-27.57,;12.56,-26.36,;11.2,-26.81,;11.19,-28.3,;12.5,-28.81,;13.91,-28.49,;15.45,-28.45,;13.95,-26.96,;12.87,-29.75,)|
Show InChI InChI=1S/C19H26N2O4S/c1-24-18-21-15(13-3-2-4-25-13)16(26-18)17(22)20-14-11-5-10-6-12(14)9-19(23,7-10)8-11/h10-14,23H,2-9H2,1H3,(H,20,22)/t10?,11?,12?,13-,14-,19-/m1/s1
Reactome pathway
n/an/a 7.20n/an/an/an/an/an/a
AstraZeneca
Curated by ChEMBL
Assay Description
Inhibition of N-terminal 6-His-tagged full-length human 11beta-HSD1 assessed as conversion of cortisone to cortisol after 25 mins by competitive HTRF...
J Med Chem 57: 970-86 (2014)
Article DOI: 10.1021/jm4016729
BindingDB Entry DOI: 10.7270/Q2Z32149
11-beta-hydroxysteroid dehydrogenase 1
(Mus musculus (mouse))
BDBM50448706
(CHEMBL3127854)
Show SMILES COc1nc([C@H]2CCCO2)c(s1)C(=O)N[C@H]1C2CC3CC1C[C@](O)(C3)C2 |r,wU:22.25,wD:15.16,5.4,TLB:14:15:19:21.22.24,25:22:15.16.17:19,THB:25:16:19:21.22.24,24:22:15:17.18.19,24:18:15:21.25.22,23:22:15:17.18.19,23:22:15.16.17:19,(.87,-30.81,;2.03,-29.8,;3.48,-30.3,;3.94,-31.77,;5.48,-31.79,;6.36,-33.05,;5.87,-34.5,;7.1,-35.43,;8.36,-34.54,;7.91,-33.07,;5.97,-30.33,;4.74,-29.41,;7.31,-29.56,;7.3,-28.02,;8.64,-30.32,;9.97,-29.55,;11.47,-29.16,;11.5,-27.57,;12.56,-26.36,;11.2,-26.81,;11.19,-28.3,;12.5,-28.81,;13.91,-28.49,;15.45,-28.45,;13.95,-26.96,;12.87,-29.75,)|
Show InChI InChI=1S/C19H26N2O4S/c1-24-18-21-15(13-3-2-4-25-13)16(26-18)17(22)20-14-11-5-10-6-12(14)9-19(23,7-10)8-11/h10-14,23H,2-9H2,1H3,(H,20,22)/t10?,11?,12?,13-,14-,19-/m1/s1
Reactome pathway
n/an/a 34n/an/an/an/an/an/a
AstraZeneca
Curated by ChEMBL
Assay Description
Inhibition of N-terminal 6-His-tagged full-length mouse 11beta-HSD1 assessed as conversion of cortisone to cortisol after 25 mins by competitive HTRF...
J Med Chem 57: 970-86 (2014)
Article DOI: 10.1021/jm4016729
BindingDB Entry DOI: 10.7270/Q2Z32149
11-beta-hydroxysteroid dehydrogenase 1
(Homo sapiens (Human))
BDBM50448706
(CHEMBL3127854)
Show SMILES COc1nc([C@H]2CCCO2)c(s1)C(=O)N[C@H]1C2CC3CC1C[C@](O)(C3)C2 |r,wU:22.25,wD:15.16,5.4,TLB:14:15:19:21.22.24,25:22:15.16.17:19,THB:25:16:19:21.22.24,24:22:15:17.18.19,24:18:15:21.25.22,23:22:15:17.18.19,23:22:15.16.17:19,(.87,-30.81,;2.03,-29.8,;3.48,-30.3,;3.94,-31.77,;5.48,-31.79,;6.36,-33.05,;5.87,-34.5,;7.1,-35.43,;8.36,-34.54,;7.91,-33.07,;5.97,-30.33,;4.74,-29.41,;7.31,-29.56,;7.3,-28.02,;8.64,-30.32,;9.97,-29.55,;11.47,-29.16,;11.5,-27.57,;12.56,-26.36,;11.2,-26.81,;11.19,-28.3,;12.5,-28.81,;13.91,-28.49,;15.45,-28.45,;13.95,-26.96,;12.87,-29.75,)|
Show InChI InChI=1S/C19H26N2O4S/c1-24-18-21-15(13-3-2-4-25-13)16(26-18)17(22)20-14-11-5-10-6-12(14)9-19(23,7-10)8-11/h10-14,23H,2-9H2,1H3,(H,20,22)/t10?,11?,12?,13-,14-,19-/m1/s1
Reactome pathway
n/an/a 0.400n/an/an/an/an/an/a
AstraZeneca
Curated by ChEMBL
Assay Description
Inhibition of recombinant human 11beta-HSD1 using cortisone/[3H]-cortisone as substrate after 5 hrs by reverse-phase HPLC analysis
J Med Chem 57: 970-86 (2014)
Article DOI: 10.1021/jm4016729
BindingDB Entry DOI: 10.7270/Q2Z32149