BDBM50448838 CHEMBL3125247
SMILES: CCc1cc(C(=O)N[C@@H]2C[C@H](N(C2)C(=O)c2coc3ccccc23)C(=O)NCCc2ccc(F)cc2)n(C)n1
InChI Key: InChIKey=VCBRPPHTBLKJJL-BWKNWUBXSA-N
Data: 1 IC50
Activity Spreadsheet -- Enzyme Inhibition Constant Data from BindingDB
Found 1 hit for monomerid = 50448838
Trg + Lig
Ki
nM
ΔG°
kcal/mole
IC50
nM
Kd
nM
EC50/IC50
nM
koff
s-1
kon
M-1s-1
pHTemp
°C
Enoyl-ACP Reductase (InhA)
(Mycobacterium tuberculosis (strain ATCC 25618 / H3...)
BDBM50448838
(CHEMBL3125247)
Show SMILES CCc1cc(C(=O)N[C@@H]2C[C@H](N(C2)C(=O)c2coc3ccccc23)C(=O)NCCc2ccc(F)cc2)n(C)n1 |r|
Show InChI InChI=1S/C29H30FN5O4/c1-3-20-14-24(34(2)33-20)28(37)32-21-15-25(27(36)31-13-12-18-8-10-19(30)11-9-18)35(16-21)29(38)23-17-39-26-7-5-4-6-22(23)26/h4-11,14,17,21,25H,3,12-13,15-16H2,1-2H3,(H,31,36)(H,32,37)/t21-,25+/m1/s1
n/an/a 6n/an/an/an/an/an/a
GlaxoSmithKline
Curated by ChEMBL
Assay Description
Inhibition of Mycobacterium tuberculosis full length biotinylated InhA (270 amino acids) using DDCoA as substrate assessed as NADH oxidation by fluor...
J Med Chem 57: 1276-88 (2014)
Article DOI: 10.1021/jm401326j
BindingDB Entry DOI: 10.7270/Q2NP25XB