BDBM50448840 CHEMBL3125245
SMILES: CCc1cc(C(=O)N[C@@H]2C[C@H](N(C2)C(=O)c2coc3ccccc23)C(=O)Nc2ccc3COB(O)c3c2)n(C)n1
InChI Key: InChIKey=OJQPVBOQJXMXOT-DVECYGJZSA-N
Data: 1 IC50
Activity Spreadsheet -- Enzyme Inhibition Constant Data from BindingDB
Found 1 hit for monomerid = 50448840
Trg + Lig
Ki
nM
ΔG°
kcal/mole
IC50
nM
Kd
nM
EC50/IC50
nM
koff
s-1
kon
M-1s-1
pHTemp
°C
Enoyl-ACP Reductase (InhA)
(Mycobacterium tuberculosis (strain ATCC 25618 / H3...)
BDBM50448840
(CHEMBL3125245)
Show SMILES CCc1cc(C(=O)N[C@@H]2C[C@H](N(C2)C(=O)c2coc3ccccc23)C(=O)Nc2ccc3COB(O)c3c2)n(C)n1 |r|
Show InChI InChI=1S/C28H28BN5O6/c1-3-17-11-23(33(2)32-17)26(35)31-19-12-24(27(36)30-18-9-8-16-14-40-29(38)22(16)10-18)34(13-19)28(37)21-15-39-25-7-5-4-6-20(21)25/h4-11,15,19,24,38H,3,12-14H2,1-2H3,(H,30,36)(H,31,35)/t19-,24+/m1/s1
n/an/a 26n/an/an/an/an/an/a
GlaxoSmithKline
Curated by ChEMBL
Assay Description
Inhibition of Mycobacterium tuberculosis full length biotinylated InhA (270 amino acids) using DDCoA as substrate assessed as NADH oxidation by fluor...
J Med Chem 57: 1276-88 (2014)
Article DOI: 10.1021/jm401326j
BindingDB Entry DOI: 10.7270/Q2NP25XB