BDBM50448849 CHEMBL3125236
SMILES: CCc1cc(C(=O)N[C@@H]2C[C@H](N(C2)C(=O)c2coc3ccccc23)C(=O)NC2CCOC2=O)n(C)n1
InChI Key: InChIKey=SJUZSBQBYFGBBL-BIYUGTDDSA-N
Data: 1 IC50
Activity Spreadsheet -- Enzyme Inhibition Constant Data from BindingDB
Found 1 hit for monomerid = 50448849
Trg + Lig
Ki
nM
ΔG°
kcal/mole
IC50
nM
Kd
nM
EC50/IC50
nM
koff
s-1
kon
M-1s-1
pHTemp
°C
Enoyl-ACP Reductase (InhA)
(Mycobacterium tuberculosis (strain ATCC 25618 / H3...)
BDBM50448849
(CHEMBL3125236)
Show SMILES CCc1cc(C(=O)N[C@@H]2C[C@H](N(C2)C(=O)c2coc3ccccc23)C(=O)NC2CCOC2=O)n(C)n1 |r|
Show InChI InChI=1S/C25H27N5O6/c1-3-14-10-19(29(2)28-14)22(31)26-15-11-20(23(32)27-18-8-9-35-25(18)34)30(12-15)24(33)17-13-36-21-7-5-4-6-16(17)21/h4-7,10,13,15,18,20H,3,8-9,11-12H2,1-2H3,(H,26,31)(H,27,32)/t15-,18?,20+/m1/s1
n/an/a 80n/an/an/an/an/an/a
GlaxoSmithKline
Curated by ChEMBL
Assay Description
Inhibition of Mycobacterium tuberculosis full length biotinylated InhA (270 amino acids) using DDCoA as substrate assessed as NADH oxidation by fluor...
J Med Chem 57: 1276-88 (2014)
Article DOI: 10.1021/jm401326j
BindingDB Entry DOI: 10.7270/Q2NP25XB