BDBM50448890 CHEMBL3125251
SMILES: CCc1cc(C(=O)N[C@@H]2C[C@H](N(C2)C(=O)c2coc3ccccc23)C(=O)Nc2nc(C)co2)n(C)n1
InChI Key: InChIKey=GIXZFWBQSUESTL-UZLBHIALSA-N
Data: 1 IC50
Activity Spreadsheet -- Enzyme Inhibition Constant Data from BindingDB
Found 1 hit for monomerid = 50448890
Trg + Lig
Ki
nM
ΔG°
kcal/mole
IC50
nM
Kd
nM
EC50/IC50
nM
koff
s-1
kon
M-1s-1
pHTemp
°C
Enoyl-[acyl-carrier-protein] reductase [NADH]
(Mycobacterium tuberculosis (strain ATCC 25618 / H3...)
BDBM50448890
(CHEMBL3125251)
Show SMILES CCc1cc(C(=O)N[C@@H]2C[C@H](N(C2)C(=O)c2coc3ccccc23)C(=O)Nc2nc(C)co2)n(C)n1 |r|
Show InChI InChI=1S/C25H26N6O5/c1-4-15-9-19(30(3)29-15)22(32)27-16-10-20(23(33)28-25-26-14(2)12-36-25)31(11-16)24(34)18-13-35-21-8-6-5-7-17(18)21/h5-9,12-13,16,20H,4,10-11H2,1-3H3,(H,27,32)(H,26,28,33)/t16-,20+/m1/s1
n/an/a 9n/an/an/an/an/an/a
GlaxoSmithKline
Curated by ChEMBL
Assay Description
Inhibition of Mycobacterium tuberculosis full length biotinylated InhA (270 amino acids) using DDCoA as substrate assessed as NADH oxidation by fluor...
J Med Chem 57: 1276-88 (2014)
Article DOI: 10.1021/jm401326j
BindingDB Entry DOI: 10.7270/Q2NP25XB