BDBM50448897 CHEMBL3125304
SMILES: BrCc1ccc(nc1)-c1cnc(o1)C(=O)CCCCCCc1ccccc1
InChI Key: InChIKey=RMKARPFBBLYTOO-UHFFFAOYSA-N
Data: 4 KI  5 IC50
Activity Spreadsheet -- Enzyme Inhibition Constant Data from BindingDB
Found 9 hits for monomerid = 50448897
Trg + Lig
Ki
nM
ΔG°
kcal/mole
IC50
nM
Kd
nM
EC50/IC50
nM
koff
s-1
kon
M-1s-1
pHTemp
°C
Fatty-acid amide hydrolase 1 (aa 30-579)
(Rattus norvegicus (rat))
BDBM50448897
(CHEMBL3125304)
Show SMILES BrCc1ccc(nc1)-c1cnc(o1)C(=O)CCCCCCc1ccccc1
Show InChI InChI=1S/C22H23BrN2O2/c23-14-18-12-13-19(24-15-18)21-16-25-22(27-21)20(26)11-7-2-1-4-8-17-9-5-3-6-10-17/h3,5-6,9-10,12-13,15-16H,1-2,4,7-8,11,14H2
0.200n/an/an/an/an/an/an/an/a
The Scripps Research Institute
Curated by ChEMBL
Assay Description
Time-dependent inhibition of recombinant rat FAAH expressed in Escherichia coli assessed as breakdown of [14C]-oleamide preincubated for 1 hr by Dixo...
J Med Chem 57: 1079-89 (2014)
Article DOI: 10.1021/jm401820q
BindingDB Entry DOI: 10.7270/Q2HX1F5K
Fatty-acid amide hydrolase 1 (aa 30-579)
(Rattus norvegicus (rat))
BDBM50448897
(CHEMBL3125304)
Show SMILES BrCc1ccc(nc1)-c1cnc(o1)C(=O)CCCCCCc1ccccc1
Show InChI InChI=1S/C22H23BrN2O2/c23-14-18-12-13-19(24-15-18)21-16-25-22(27-21)20(26)11-7-2-1-4-8-17-9-5-3-6-10-17/h3,5-6,9-10,12-13,15-16H,1-2,4,7-8,11,14H2
0.200n/an/an/an/an/an/an/an/a
The Scripps Research Institute
Curated by ChEMBL
Assay Description
Time-dependent inhibition of recombinant rat FAAH expressed in Escherichia coli assessed as breakdown of [14C]-oleamide preincubated for 3 hrs by Dix...
J Med Chem 57: 1079-89 (2014)
Article DOI: 10.1021/jm401820q
BindingDB Entry DOI: 10.7270/Q2HX1F5K
Fatty-acid amide hydrolase 1 (aa 30-579)
(Rattus norvegicus (rat))
BDBM50448897
(CHEMBL3125304)
Show SMILES BrCc1ccc(nc1)-c1cnc(o1)C(=O)CCCCCCc1ccccc1
Show InChI InChI=1S/C22H23BrN2O2/c23-14-18-12-13-19(24-15-18)21-16-25-22(27-21)20(26)11-7-2-1-4-8-17-9-5-3-6-10-17/h3,5-6,9-10,12-13,15-16H,1-2,4,7-8,11,14H2
0.200n/an/an/an/an/an/an/an/a
The Scripps Research Institute
Curated by ChEMBL
Assay Description
Time-dependent inhibition of recombinant rat FAAH expressed in Escherichia coli assessed as breakdown of [14C]-oleamide preincubated for 6 hrs by Dix...
J Med Chem 57: 1079-89 (2014)
Article DOI: 10.1021/jm401820q
BindingDB Entry DOI: 10.7270/Q2HX1F5K
Fatty-acid amide hydrolase 1 (aa 30-579)
(Rattus norvegicus (rat))
BDBM50448897
(CHEMBL3125304)
Show SMILES BrCc1ccc(nc1)-c1cnc(o1)C(=O)CCCCCCc1ccccc1
Show InChI InChI=1S/C22H23BrN2O2/c23-14-18-12-13-19(24-15-18)21-16-25-22(27-21)20(26)11-7-2-1-4-8-17-9-5-3-6-10-17/h3,5-6,9-10,12-13,15-16H,1-2,4,7-8,11,14H2
3.10n/an/an/an/an/an/an/an/a
The Scripps Research Institute
Curated by ChEMBL
Assay Description
Inhibition of recombinant rat FAAH expressed in Escherichia coli assessed as breakdown of [14C]-oleamide by Dixon plot analysis
J Med Chem 57: 1079-89 (2014)
Article DOI: 10.1021/jm401820q
BindingDB Entry DOI: 10.7270/Q2HX1F5K
Carboxylesterase 1D
(Mus musculus)
BDBM50448897
(CHEMBL3125304)
Show SMILES BrCc1ccc(nc1)-c1cnc(o1)C(=O)CCCCCCc1ccccc1
Show InChI InChI=1S/C22H23BrN2O2/c23-14-18-12-13-19(24-15-18)21-16-25-22(27-21)20(26)11-7-2-1-4-8-17-9-5-3-6-10-17/h3,5-6,9-10,12-13,15-16H,1-2,4,7-8,11,14H2
n/an/a 400n/an/an/an/an/an/a
The Scripps Research Institute
Curated by ChEMBL
Assay Description
Competitive inhibition of mouse heart membrane TGH preincubated for 6 hrs followed by FP-rhodamine addition measured after 10 mins by fluorescence sc...
J Med Chem 57: 1079-89 (2014)
Article DOI: 10.1021/jm401820q
BindingDB Entry DOI: 10.7270/Q2HX1F5K
KIAA1363
(Mus musculus (mouse))
BDBM50448897
(CHEMBL3125304)
Show SMILES BrCc1ccc(nc1)-c1cnc(o1)C(=O)CCCCCCc1ccccc1
Show InChI InChI=1S/C22H23BrN2O2/c23-14-18-12-13-19(24-15-18)21-16-25-22(27-21)20(26)11-7-2-1-4-8-17-9-5-3-6-10-17/h3,5-6,9-10,12-13,15-16H,1-2,4,7-8,11,14H2
n/an/a>1.00E+5n/an/an/an/an/an/a
The Scripps Research Institute
Curated by ChEMBL
Assay Description
Competitive inhibition of mouse brain membrane KIAA1363 preincubated for 6 hrs followed by FP-rhodamine addition measured after 10 mins by fluorescen...
J Med Chem 57: 1079-89 (2014)
Article DOI: 10.1021/jm401820q
BindingDB Entry DOI: 10.7270/Q2HX1F5K
Monoglyceride Lipase (MGL)
(Mus musculus (mouse))
BDBM50448897
(CHEMBL3125304)
Show SMILES BrCc1ccc(nc1)-c1cnc(o1)C(=O)CCCCCCc1ccccc1
Show InChI InChI=1S/C22H23BrN2O2/c23-14-18-12-13-19(24-15-18)21-16-25-22(27-21)20(26)11-7-2-1-4-8-17-9-5-3-6-10-17/h3,5-6,9-10,12-13,15-16H,1-2,4,7-8,11,14H2
Reactome pathway
n/an/a 8.00E+3n/an/an/an/an/an/a
The Scripps Research Institute
Curated by ChEMBL
Assay Description
Competitive inhibition of mouse brain membrane MAGL preincubated for 6 hrs followed by FP-rhodamine addition measured after 10 mins by fluorescence s...
J Med Chem 57: 1079-89 (2014)
Article DOI: 10.1021/jm401820q
BindingDB Entry DOI: 10.7270/Q2HX1F5K
Abhydrolase Domain-Containing Protein 6
(Mus musculus (mouse))
BDBM50448897
(CHEMBL3125304)
Show SMILES BrCc1ccc(nc1)-c1cnc(o1)C(=O)CCCCCCc1ccccc1
Show InChI InChI=1S/C22H23BrN2O2/c23-14-18-12-13-19(24-15-18)21-16-25-22(27-21)20(26)11-7-2-1-4-8-17-9-5-3-6-10-17/h3,5-6,9-10,12-13,15-16H,1-2,4,7-8,11,14H2
n/an/a>1.00E+5n/an/an/an/an/an/a
The Scripps Research Institute
Curated by ChEMBL
Assay Description
Competitive inhibition of mouse brain membrane ABHD6 preincubated for 6 hrs followed by FP-rhodamine addition measured after 10 mins by fluorescence ...
J Med Chem 57: 1079-89 (2014)
Article DOI: 10.1021/jm401820q
BindingDB Entry DOI: 10.7270/Q2HX1F5K
Anandamide amidohydrolase
(Mus musculus (mouse))
BDBM50448897
(CHEMBL3125304)
Show SMILES BrCc1ccc(nc1)-c1cnc(o1)C(=O)CCCCCCc1ccccc1
Show InChI InChI=1S/C22H23BrN2O2/c23-14-18-12-13-19(24-15-18)21-16-25-22(27-21)20(26)11-7-2-1-4-8-17-9-5-3-6-10-17/h3,5-6,9-10,12-13,15-16H,1-2,4,7-8,11,14H2
n/an/a 30n/an/an/an/an/an/a
The Scripps Research Institute
Curated by ChEMBL
Assay Description
Competitive inhibition of mouse FAAH preincubated for 6 hrs followed by FP-rhodamine addition measured after 10 mins by fluorescence scanning
J Med Chem 57: 1079-89 (2014)
Article DOI: 10.1021/jm401820q
BindingDB Entry DOI: 10.7270/Q2HX1F5K