BDBM50448967 CHEMBL3125533
SMILES: CC(C)(C)S(=O)(=O)C[C@H](CC(F)(F)F)N1[C@@H]([C@H](C[C@](C)(CC(O)=O)C1=O)c1cccc(Cl)c1)c1ccc(Cl)cc1
InChI Key: InChIKey=UXTMCOJFIVJBRG-CXTNQITHSA-N
Data: 1 IC50
Activity Spreadsheet -- Enzyme Inhibition Constant Data from BindingDB
Found 1 hit for monomerid = 50448967
Trg + Lig
Ki
nM
ΔG°
kcal/mole
IC50
nM
Kd
nM
EC50/IC50
nM
koff
s-1
kon
M-1s-1
pHTemp
°C
E3 ubiquitin-protein ligase Mdm2
(Homo sapiens (Human))
BDBM50448967
(CHEMBL3125533)
Show SMILES CC(C)(C)S(=O)(=O)C[C@H](CC(F)(F)F)N1[C@@H]([C@H](C[C@](C)(CC(O)=O)C1=O)c1cccc(Cl)c1)c1ccc(Cl)cc1 |r|
Show InChI InChI=1S/C28H32Cl2F3NO5S/c1-26(2,3)40(38,39)16-21(13-28(31,32)33)34-24(17-8-10-19(29)11-9-17)22(18-6-5-7-20(30)12-18)14-27(4,25(34)37)15-23(35)36/h5-12,21-22,24H,13-16H2,1-4H3,(H,35,36)/t21-,22+,24+,27+/m0/s1
NCI pathway
Reactome pathway
n/an/a 0.100n/an/an/an/an/an/a
Amgen Inc.
Curated by ChEMBL
Assay Description
Binding affinity to human GST-thrombin-tagged MDM2 assessed as inhibition of interaction with human p53 after 1 hr by HTRF assay
J Med Chem 57: 1454-72 (2014)
Article DOI: 10.1021/jm401753e
BindingDB Entry DOI: 10.7270/Q24M960Z