BDBM50448971 CHEMBL3125514
SMILES: CC[C@@H](CNS(=O)(=O)C1CC1)N1[C@@H]([C@H](C[C@](C)(CC(O)=O)C1=O)c1cccc(Cl)c1)c1ccc(Cl)cc1
InChI Key: InChIKey=YGHOMOFTRXHIOD-OCBXDECUSA-N
Data: 1 IC50
Activity Spreadsheet -- Enzyme Inhibition Constant Data from BindingDB
Found 1 hit for monomerid = 50448971
Trg + Lig
Ki
nM
ΔG°
kcal/mole
IC50
nM
Kd
nM
EC50/IC50
nM
koff
s-1
kon
M-1s-1
pHTemp
°C
E3 ubiquitin-protein ligase Mdm2
(Homo sapiens (Human))
BDBM50448971
(CHEMBL3125514)
Show SMILES CC[C@@H](CNS(=O)(=O)C1CC1)N1[C@@H]([C@H](C[C@](C)(CC(O)=O)C1=O)c1cccc(Cl)c1)c1ccc(Cl)cc1 |r|
Show InChI InChI=1S/C27H32Cl2N2O5S/c1-3-21(16-30-37(35,36)22-11-12-22)31-25(17-7-9-19(28)10-8-17)23(18-5-4-6-20(29)13-18)14-27(2,26(31)34)15-24(32)33/h4-10,13,21-23,25,30H,3,11-12,14-16H2,1-2H3,(H,32,33)/t21-,23+,25+,27+/m0/s1
NCI pathway
Reactome pathway
n/an/a 0.5n/an/an/an/an/an/a
Amgen Inc.
Curated by ChEMBL
Assay Description
Binding affinity to human GST-thrombin-tagged MDM2 assessed as inhibition of interaction with human p53 after 1 hr by HTRF assay
J Med Chem 57: 1454-72 (2014)
Article DOI: 10.1021/jm401753e
BindingDB Entry DOI: 10.7270/Q24M960Z