null
SMILES: CCOC(=O)c1nnn(c1[C@H](O)[C@@H](O)[C@H](C)O)-c1ccc(Br)cc1
InChI Key: InChIKey=XMRKJAXKIRJPFH-YZMDESFKSA-N
Activity Spreadsheet -- Enzyme Inhibition Constant Data from BindingDB
Found 2 hits for monomerid = 50449254
Trg + Lig
Ki
nM
ΔG°
kcal/mole
IC50
nM
Kd
nM
EC50/IC50
nM
koff
s-1
kon
M-1s-1
pHTemp
°C
Sodium/glucose cotransporter 2
(Homo sapiens (Human))
BDBM50449254
(CHEMBL3125156)
Show SMILES CCOC(=O)c1nnn(c1[C@H](O)[C@@H](O)[C@H](C)O)-c1ccc(Br)cc1 |r|
Show InChI InChI=1S/C15H18BrN3O5/c1-3-24-15(23)11-12(14(22)13(21)8(2)20)19(18-17-11)10-6-4-9(16)5-7-10/h4-8,13-14,20-22H,3H2,1-2H3/t8-,13-,14-/m0/s1
n/an/a 311n/an/an/an/an/an/a
CSIR-Indian Institute of Chemical Technology
Curated by ChEMBL
Assay Description
Inhibition of SGLT2 (unknown origin) expressed in HEK293 cells using 2-NBDG as substrate incubated for 30 mins prior to substrate addition measured a...
Bioorg Med Chem Lett 24: 1528-31 (2014)
Article DOI: 10.1016/j.bmcl.2014.01.077
BindingDB Entry DOI: 10.7270/Q2PG1T6N
Sodium/glucose cotransporter 1
(Homo sapiens (Human))
BDBM50449254
(CHEMBL3125156)
Show SMILES CCOC(=O)c1nnn(c1[C@H](O)[C@@H](O)[C@H](C)O)-c1ccc(Br)cc1 |r|
Show InChI InChI=1S/C15H18BrN3O5/c1-3-24-15(23)11-12(14(22)13(21)8(2)20)19(18-17-11)10-6-4-9(16)5-7-10/h4-8,13-14,20-22H,3H2,1-2H3/t8-,13-,14-/m0/s1
n/an/a 629n/an/an/an/an/an/a
CSIR-Indian Institute of Chemical Technology
Curated by ChEMBL
Assay Description
Inhibition of SGLT1 (unknown origin) expressed in HEK293 cells using 2-NBDG as substrate incubated for 30 mins prior to substrate addition measured a...
Bioorg Med Chem Lett 24: 1528-31 (2014)
Article DOI: 10.1016/j.bmcl.2014.01.077
BindingDB Entry DOI: 10.7270/Q2PG1T6N