BDBM50449268 CHEMBL3125338
SMILES: C[C@]1(CC(=NO1)c1ccc2c(c1)nc(CCCCC(O)=O)n(-c1ccc(F)cc1)c2=O)c1cccc(c1)C#N
InChI Key: InChIKey=BIMLAQIEVSHWMO-PMERELPUSA-N
Data: 1 KI  1 IC50
Activity Spreadsheet -- Enzyme Inhibition Constant Data from BindingDB
Found 2 hits for monomerid = 50449268
Trg + Lig
Ki
nM
ΔG°
kcal/mole
IC50
nM
Kd
nM
EC50/IC50
nM
koff
s-1
kon
M-1s-1
pHTemp
°C
G protein-coupled receptor 44
(Homo sapiens (Human))
BDBM50449268
(CHEMBL3125338)
Show SMILES C[C@]1(CC(=NO1)c1ccc2c(c1)nc(CCCCC(O)=O)n(-c1ccc(F)cc1)c2=O)c1cccc(c1)C#N |r,c:3|
Show InChI InChI=1S/C30H25FN4O4/c1-30(21-6-4-5-19(15-21)18-32)17-26(34-39-30)20-9-14-24-25(16-20)33-27(7-2-3-8-28(36)37)35(29(24)38)23-12-10-22(31)11-13-23/h4-6,9-16H,2-3,7-8,17H2,1H3,(H,36,37)/t30-/m0/s1
Reactome pathway
3n/an/an/an/an/an/an/an/a
Merck Research Laboratories
Curated by ChEMBL
Assay Description
Antagonist activity at human CRTH2 receptor expressed in CHO-1 cells assessed as inhibition of PGD2-induced Ca2+ flux preincubated for 30 mins follow...
Bioorg Med Chem Lett 24: 1615-20 (2014)
Article DOI: 10.1016/j.bmcl.2014.01.043
BindingDB Entry DOI: 10.7270/Q2JQ12G9
G protein-coupled receptor 44
(Homo sapiens (Human))
BDBM50449268
(CHEMBL3125338)
Show SMILES C[C@]1(CC(=NO1)c1ccc2c(c1)nc(CCCCC(O)=O)n(-c1ccc(F)cc1)c2=O)c1cccc(c1)C#N |r,c:3|
Show InChI InChI=1S/C30H25FN4O4/c1-30(21-6-4-5-19(15-21)18-32)17-26(34-39-30)20-9-14-24-25(16-20)33-27(7-2-3-8-28(36)37)35(29(24)38)23-12-10-22(31)11-13-23/h4-6,9-16H,2-3,7-8,17H2,1H3,(H,36,37)/t30-/m0/s1
Reactome pathway
n/an/a 5.20n/an/an/an/an/an/a
Merck Research Laboratories
Curated by ChEMBL
Assay Description
Antagonist activity at human CRTH2 receptor expressed in HEK cells assessed as inhibition of forskolin-induced cAMP formation preincubated for 10 min...
Bioorg Med Chem Lett 24: 1615-20 (2014)
Article DOI: 10.1016/j.bmcl.2014.01.043
BindingDB Entry DOI: 10.7270/Q2JQ12G9