null
SMILES: [O-][N+](=O)c1cccc(c1)-c1nc2ccccc2c(=O)o1
InChI Key: InChIKey=WKYQIWUAPDQQRV-UHFFFAOYSA-N
Activity Spreadsheet -- Enzyme Inhibition Constant Data from BindingDB
Found 3 hits for monomerid = 50449429
Trg + Lig
Ki
nM
ΔG°
kcal/mole
IC50
nM
Kd
nM
EC50/IC50
nM
koff
s-1
kon
M-1s-1
pHTemp
°C
Neutrophil elastase
(Homo sapiens (Human))
BDBM50449429
(2-(3-Nitrophenyl)-4H-3,1-benzoxazin-4-one (18) | C...)
Show SMILES [O-][N+](=O)c1cccc(c1)-c1nc2ccccc2c(=O)o1
Show InChI InChI=1S/C14H8N2O4/c17-14-11-6-1-2-7-12(11)15-13(20-14)9-4-3-5-10(8-9)16(18)19/h1-8H
Reactome pathway
3.98E+3n/an/an/an/an/an/an/an/a
Syntex Research
Curated by ChEMBL
Assay Description
Component deacylation rate constant for interaction with human leukocyte elastase
J Med Chem 33: 464-79 (1990)
Checked by Author
BindingDB Entry DOI: 10.7270/Q2PR7X6X
Chymotrypsinogen A
(Bos taurus (bovine))
BDBM50449429
(2-(3-Nitrophenyl)-4H-3,1-benzoxazin-4-one (18) | C...)
Show SMILES [O-][N+](=O)c1cccc(c1)-c1nc2ccccc2c(=O)o1
Show InChI InChI=1S/C14H8N2O4/c17-14-11-6-1-2-7-12(11)15-13(20-14)9-4-3-5-10(8-9)16(18)19/h1-8H
Reactome pathway
3.41E+5n/an/an/an/an/an/an/an/a
University of Karachi
Assay Description
The change in optical density per minute (OD/min) was obtained by incorporating various concentrations of compounds over a range of substrate (SPpNA)...
Bioorg Chem 70: 210-221 (2017)
Article DOI: 10.1016/j.bioorg.2017.01.001
BindingDB Entry DOI: 10.7270/Q2QR4W00
Chymotrypsinogen A
(Bos taurus (bovine))
BDBM50449429
(2-(3-Nitrophenyl)-4H-3,1-benzoxazin-4-one (18) | C...)
Show SMILES [O-][N+](=O)c1cccc(c1)-c1nc2ccccc2c(=O)o1
Show InChI InChI=1S/C14H8N2O4/c17-14-11-6-1-2-7-12(11)15-13(20-14)9-4-3-5-10(8-9)16(18)19/h1-8H
Reactome pathway
n/an/a 3.41E+5n/an/an/an/a7.6n/a
University of Karachi
Assay Description
The α-chymotrypsin inhibition activity was evaluated in 50 mM Tris-HCl buffer pH 7.6 with 10 mM CaCl2. α-Chymotrypsin (bovine pancreas) at ...
Bioorg Chem 70: 210-221 (2017)
Article DOI: 10.1016/j.bioorg.2017.01.001
BindingDB Entry DOI: 10.7270/Q2QR4W00