BDBM50451120 CHEMBL2115434
SMILES: Cc1cc(O)cc(C)c1C[C@@H](N)C(=O)N1Cc2c(C[C@H]1C(O)=O)cc(Br)c(O)c2Br
InChI Key: InChIKey=PGRCDRUJAVJRKB-SJORKVTESA-N
Data: 2 IC50
Activity Spreadsheet -- Enzyme Inhibition Constant Data from BindingDB
Found 2 hits for monomerid = 50451120
Trg + Lig
Ki
nM
ΔG°
kcal/mole
IC50
nM
Kd
nM
EC50/IC50
nM
koff
s-1
kon
M-1s-1
pHTemp
°C
Delta-type opioid receptor
(Homo sapiens (Human))
BDBM50451120
(CHEMBL2115434)
Show SMILES Cc1cc(O)cc(C)c1C[C@@H](N)C(=O)N1Cc2c(C[C@H]1C(O)=O)cc(Br)c(O)c2Br
Show InChI InChI=1S/C21H22Br2N2O5/c1-9-3-12(26)4-10(2)13(9)7-16(24)20(28)25-8-14-11(6-17(25)21(29)30)5-15(22)19(27)18(14)23/h3-5,16-17,26-27H,6-8,24H2,1-2H3,(H,29,30)/t16-,17+/m1/s1
Reactome pathway
n/an/a>1.00E+4n/an/an/an/an/an/a
AstraZeneca R&D Montréal
Curated by ChEMBL
Assay Description
Compound was evaluated for binding affinity towards Opioid receptor delta 1 by displacing 125 I-deltorphin II
Bioorg Med Chem Lett 10: 167-70 (2000)
BindingDB Entry DOI: 10.7270/Q2RV0MXM
Mu-type opioid receptor
(Homo sapiens (Human))
BDBM50451120
(CHEMBL2115434)
Show SMILES Cc1cc(O)cc(C)c1C[C@@H](N)C(=O)N1Cc2c(C[C@H]1C(O)=O)cc(Br)c(O)c2Br
Show InChI InChI=1S/C21H22Br2N2O5/c1-9-3-12(26)4-10(2)13(9)7-16(24)20(28)25-8-14-11(6-17(25)21(29)30)5-15(22)19(27)18(14)23/h3-5,16-17,26-27H,6-8,24H2,1-2H3,(H,29,30)/t16-,17+/m1/s1
NCI pathway
Reactome pathway
n/an/a 8.13E+3n/an/an/an/an/an/a
AstraZeneca R&D Montréal
Curated by ChEMBL
Assay Description
Compound was evaluated for binding affinity towards Opioid receptor mu 1 by displacing 125 I-FK-33824
Bioorg Med Chem Lett 10: 167-70 (2000)
BindingDB Entry DOI: 10.7270/Q2RV0MXM