BDBM50451459 CHEMBL4208664
SMILES: NCc1cc(ccn1)-c1cc(ccc1Oc1cc(F)c(cc1Cl)S(=O)(=O)Nc1nncs1)-c1cccc(c1)C(F)(F)F
InChI Key: InChIKey=GXAKJTDJSYRFIB-UHFFFAOYSA-N
Data: 1 IC50
Activity Spreadsheet -- Enzyme Inhibition Constant Data from BindingDB
Found 1 hit for monomerid = 50451459
Trg + Lig
Ki
nM
ΔG°
kcal/mole
IC50
nM
Kd
nM
EC50/IC50
nM
koff
s-1
kon
M-1s-1
pHTemp
°C
Sodium channel protein type 9 subunit alpha
(Homo sapiens (Human))
BDBM50451459
(CHEMBL4208664)
Show SMILES NCc1cc(ccn1)-c1cc(ccc1Oc1cc(F)c(cc1Cl)S(=O)(=O)Nc1nncs1)-c1cccc(c1)C(F)(F)F
Show InChI InChI=1S/C27H18ClF4N5O3S2/c28-21-11-25(42(38,39)37-26-36-35-14-41-26)22(29)12-24(21)40-23-5-4-16(15-2-1-3-18(8-15)27(30,31)32)10-20(23)17-6-7-34-19(9-17)13-33/h1-12,14H,13,33H2,(H,36,37)
n/an/a 1.5n/an/an/an/an/an/a
Pfizer Inc.
Curated by ChEMBL
Assay Description
Inhibition of human Nav1.7 expressed in HEK cells by automated patchXpress electrophysiology method
Bioorg Med Chem Lett 27: 4805-4811 (2017)
Article DOI: 10.1016/j.bmcl.2017.09.056
BindingDB Entry DOI: 10.7270/Q25Q4ZN1