BDBM50451624 CHEMBL331897
SMILES:
InChI Key: InChIKey=VQHKDCUXFKNNMT-ODCIPOBUSA-O
Data: 2 IC50
Activity Spreadsheet -- Enzyme Inhibition Constant Data from BindingDB
Found 2 hits for monomerid = 50451624
Trg + Lig
Ki
nM
ΔG°
kcal/mole
IC50
nM
Kd
nM
EC50/IC50
nM
koff
s-1
kon
M-1s-1
pHTemp
°C
C-C chemokine receptor type 1
(Homo sapiens (Human))
BDBM50451624
(CHEMBL331897)
Show InChI InChI=1S/C30H36Cl2N2O2/c1-2-34(20-21-8-6-4-3-5-7-9-21)16-14-24(15-17-34)33-30(35)29-25-18-22(31)10-12-27(25)36-28-13-11-23(32)19-26(28)29/h8,10-13,18-19,24,29H,2-7,9,14-17,20H2,1H3/p+1/b21-8+
Reactome pathway
n/an/a 0.900n/an/an/an/an/an/a
Roche Palo Alto
Curated by ChEMBL
Assay Description
Binding affinity towards C-C chemokine receptor type 1
Bioorg Med Chem Lett 13: 3597-600 (2003)
BindingDB Entry DOI: 10.7270/Q228085J
C-C chemokine receptor type 3
(Homo sapiens (Human))
BDBM50451624
(CHEMBL331897)
Show InChI InChI=1S/C30H36Cl2N2O2/c1-2-34(20-21-8-6-4-3-5-7-9-21)16-14-24(15-17-34)33-30(35)29-25-18-22(31)10-12-27(25)36-28-13-11-23(32)19-26(28)29/h8,10-13,18-19,24,29H,2-7,9,14-17,20H2,1H3/p+1/b21-8+
Reactome pathway
n/an/a 0.580n/an/an/an/an/an/a
Roche Palo Alto
Curated by ChEMBL
Assay Description
Binding affinity was determined towards C-C chemokine receptor type 3 using [125I]-labeled eotaxin as radioligand
Bioorg Med Chem Lett 13: 3597-600 (2003)
BindingDB Entry DOI: 10.7270/Q228085J