BDBM50451975 CHEMBL121926
SMILES: CCC1CC(=O)N(C1=O)c1ccccc1C(=O)OCC1CCCN(CCCc2ccccc2)C1
InChI Key: InChIKey=MNZKKAABVMTCFU-UHFFFAOYSA-N
Data: 1 IC50
Activity Spreadsheet -- Enzyme Inhibition Constant Data from BindingDB
Found 1 hit for monomerid = 50451975
Trg + Lig
Ki
nM
ΔG°
kcal/mole
IC50
nM
Kd
nM
EC50/IC50
nM
koff
s-1
kon
M-1s-1
pHTemp
°C
Neuronal acetylcholine receptor subunit alpha-3/beta-4
(Homo sapiens (Human))
BDBM50451975
(CHEMBL121926)
Show SMILES CCC1CC(=O)N(C1=O)c1ccccc1C(=O)OCC1CCCN(CCCc2ccccc2)C1
Show InChI InChI=1S/C28H34N2O4/c1-2-23-18-26(31)30(27(23)32)25-15-7-6-14-24(25)28(33)34-20-22-13-9-17-29(19-22)16-8-12-21-10-4-3-5-11-21/h3-7,10-11,14-15,22-23H,2,8-9,12-13,16-20H2,1H3
n/an/a 4.50E+3n/an/an/an/an/an/a
Ohio University
Curated by ChEMBL
Assay Description
Effect on alpha3-beta4 neuronal nicotinic acetylcholine receptor-stimulated adrenal catecholamine secretion
Bioorg Med Chem Lett 14: 3739-42 (2004)
Article DOI: 10.1016/j.bmcl.2004.05.001
BindingDB Entry DOI: 10.7270/Q28G8M80