BDBM50454421 CHEMBL2113529
SMILES: CCCCCCc1nc(N)c2ncn([C@@H]3O[C@@H]([C@@H](O)[C@H]3O)C(=O)NCC)c2n1
InChI Key: InChIKey=HXBNUMFVVMKQDN-MOROJQBDSA-N
Data: 2 KI  2 EC50
Activity Spreadsheet -- Enzyme Inhibition Constant Data from BindingDB
Found 4 hits for monomerid = 50454421
Trg + Lig
Ki
nM
ΔG°
kcal/mole
IC50
nM
Kd
nM
EC50/IC50
nM
koff
s-1
kon
M-1s-1
pHTemp
°C
Adenosine receptor A1
(Rattus norvegicus (rat))
BDBM50454421
(CHEMBL2113529)
Show SMILES CCCCCCc1nc(N)c2ncn([C@@H]3O[C@@H]([C@@H](O)[C@H]3O)C(=O)NCC)c2n1 |r|
Show InChI InChI=1S/C18H28N6O4/c1-3-5-6-7-8-10-22-15(19)11-16(23-10)24(9-21-11)18-13(26)12(25)14(28-18)17(27)20-4-2/h9,12-14,18,25-26H,3-8H2,1-2H3,(H,20,27)(H2,19,22,23)/t12-,13+,14-,18+/m0/s1
Reactome pathway
>1n/an/an/an/an/an/an/an/a
Universit£ di Camerino
Curated by ChEMBL
Assay Description
Displacement of [3H]CHA from Adenosine A1 receptor of rat brain
J Med Chem 39: 4211-7 (1996)
Article DOI: 10.1021/jm960376g
BindingDB Entry DOI: 10.7270/Q2542P7Q
Adenosine Receptors A2a (A2a)
(Rattus norvegicus (rat))
BDBM50454421
(CHEMBL2113529)
Show SMILES CCCCCCc1nc(N)c2ncn([C@@H]3O[C@@H]([C@@H](O)[C@H]3O)C(=O)NCC)c2n1 |r|
Show InChI InChI=1S/C18H28N6O4/c1-3-5-6-7-8-10-22-15(19)11-16(23-10)24(9-21-11)18-13(26)12(25)14(28-18)17(27)20-4-2/h9,12-14,18,25-26H,3-8H2,1-2H3,(H,20,27)(H2,19,22,23)/t12-,13+,14-,18+/m0/s1
Reactome pathway
136n/an/an/an/an/an/an/an/a
Universit£ di Camerino
Curated by ChEMBL
Assay Description
Displacement of [3H]-CGS- 51680 from Adenosine A2A receptor of rat striatum.
J Med Chem 39: 4211-7 (1996)
Article DOI: 10.1021/jm960376g
BindingDB Entry DOI: 10.7270/Q2542P7Q
Adenosine Receptors A2a (A2a)
(Rattus norvegicus (rat))
BDBM50454421
(CHEMBL2113529)
Show SMILES CCCCCCc1nc(N)c2ncn([C@@H]3O[C@@H]([C@@H](O)[C@H]3O)C(=O)NCC)c2n1 |r|
Show InChI InChI=1S/C18H28N6O4/c1-3-5-6-7-8-10-22-15(19)11-16(23-10)24(9-21-11)18-13(26)12(25)14(28-18)17(27)20-4-2/h9,12-14,18,25-26H,3-8H2,1-2H3,(H,20,27)(H2,19,22,23)/t12-,13+,14-,18+/m0/s1
Reactome pathway
n/an/an/an/a 1n/an/an/an/a
Universit£ di Camerino
Curated by ChEMBL
Assay Description
Vasorelaxation as Adenosine A2A receptor activity in rat aorta
J Med Chem 39: 4211-7 (1996)
Article DOI: 10.1021/jm960376g
BindingDB Entry DOI: 10.7270/Q2542P7Q
Adenosine receptor A1
(Rattus norvegicus (rat))
BDBM50454421
(CHEMBL2113529)
Show SMILES CCCCCCc1nc(N)c2ncn([C@@H]3O[C@@H]([C@@H](O)[C@H]3O)C(=O)NCC)c2n1 |r|
Show InChI InChI=1S/C18H28N6O4/c1-3-5-6-7-8-10-22-15(19)11-16(23-10)24(9-21-11)18-13(26)12(25)14(28-18)17(27)20-4-2/h9,12-14,18,25-26H,3-8H2,1-2H3,(H,20,27)(H2,19,22,23)/t12-,13+,14-,18+/m0/s1
Reactome pathway
n/an/an/an/a>1n/an/an/an/a
Universit£ di Camerino
Curated by ChEMBL
Assay Description
Adenosine A1 receptor mediated negative chronotropic activity in spontaneously beating rat atria
J Med Chem 39: 4211-7 (1996)
Article DOI: 10.1021/jm960376g
BindingDB Entry DOI: 10.7270/Q2542P7Q