BDBM50454569 CHEMBL4216922
SMILES: OC(=O)c1cc(Cl)ccc1NC(=O)c1cccc(c1)-c1ccccc1
InChI Key: InChIKey=AWEBQXBJTFVNOH-UHFFFAOYSA-N
Data: 1 IC50
Activity Spreadsheet -- Enzyme Inhibition Constant Data from BindingDB
Found 1 hit for monomerid = 50454569
Trg + Lig
Ki
nM
ΔG°
kcal/mole
IC50
nM
Kd
nM
EC50/IC50
nM
koff
s-1
kon
M-1s-1
pHTemp
°C
Plasminogen activator inhibitor-1
(Homo sapiens (Human))
BDBM50454569
(CHEMBL4216922)
Show SMILES OC(=O)c1cc(Cl)ccc1NC(=O)c1cccc(c1)-c1ccccc1
Show InChI InChI=1S/C20H14ClNO3/c21-16-9-10-18(17(12-16)20(24)25)22-19(23)15-8-4-7-14(11-15)13-5-2-1-3-6-13/h1-12H,(H,22,23)(H,24,25)
Reactome pathway
n/an/a 2.82E+3n/an/an/an/an/an/a
Hamari Chemicals, Ltd.
Curated by ChEMBL
Assay Description
Inhibition of human PAI-1 assessed as remaining enzyme activity by measuring p-nitroaniline release pre-incubated for 15 mins before 2 nM Spectrozyme...
Bioorg Med Chem Lett 28: 809-813 (2018)
Article DOI: 10.1016/j.bmcl.2017.11.016
BindingDB Entry DOI: 10.7270/Q2TH8Q90