BDBM50454570 CHEMBL4213580
SMILES: OC(=O)c1cc(Cl)ccc1NC(=O)c1ccc(cc1)-c1cccs1
InChI Key: InChIKey=HVFLMSZNLZOPNZ-UHFFFAOYSA-N
Data: 1 IC50
Activity Spreadsheet -- Enzyme Inhibition Constant Data from BindingDB
Found 1 hit for monomerid = 50454570
Trg + Lig
Ki
nM
ΔG°
kcal/mole
IC50
nM
Kd
nM
EC50/IC50
nM
koff
s-1
kon
M-1s-1
pHTemp
°C
Plasminogen activator inhibitor-1
(Homo sapiens (Human))
BDBM50454570
(CHEMBL4213580)
Show SMILES OC(=O)c1cc(Cl)ccc1NC(=O)c1ccc(cc1)-c1cccs1
Show InChI InChI=1S/C18H12ClNO3S/c19-13-7-8-15(14(10-13)18(22)23)20-17(21)12-5-3-11(4-6-12)16-2-1-9-24-16/h1-10H,(H,20,21)(H,22,23)
Reactome pathway
n/an/a>2.00E+4n/an/an/an/an/an/a
Hamari Chemicals, Ltd.
Curated by ChEMBL
Assay Description
Inhibition of human PAI-1 assessed as remaining enzyme activity by measuring p-nitroaniline release pre-incubated for 15 mins before 2 nM Spectrozyme...
Bioorg Med Chem Lett 28: 809-813 (2018)
Article DOI: 10.1016/j.bmcl.2017.11.016
BindingDB Entry DOI: 10.7270/Q2TH8Q90