BDBM50454578 CHEMBL4203014
SMILES: [Na;v0+].[#8-]-[#6](=O)-c1cc(Cl)ccc1-[#7]-[#6](=O)-c1cccc(c1)-c1cnc2ccccc2c1
InChI Key: InChIKey=LBOIFUCSTNEHID-UHFFFAOYSA-M
Data: 1 IC50
Activity Spreadsheet -- Enzyme Inhibition Constant Data from BindingDB
Found 1 hit for monomerid = 50454578
Trg + Lig
Ki
nM
ΔG°
kcal/mole
IC50
nM
Kd
nM
EC50/IC50
nM
koff
s-1
kon
M-1s-1
pHTemp
°C
Plasminogen activator inhibitor-1
(Homo sapiens (Human))
BDBM50454578
(CHEMBL4203014)
Show SMILES [Na;v0+].[#8-]-[#6](=O)-c1cc(Cl)ccc1-[#7]-[#6](=O)-c1cccc(c1)-c1cnc2ccccc2c1
Show InChI InChI=1S/C23H15ClN2O3/c24-18-8-9-21(19(12-18)23(28)29)26-22(27)16-6-3-5-14(10-16)17-11-15-4-1-2-7-20(15)25-13-17/h1-13H,(H,26,27)(H,28,29)/p-1
Reactome pathway
n/an/a 1.67E+3n/an/an/an/an/an/a
Hamari Chemicals, Ltd.
Curated by ChEMBL
Assay Description
Inhibition of human PAI-1 assessed as remaining enzyme activity by measuring p-nitroaniline release pre-incubated for 15 mins before 2 nM Spectrozyme...
Bioorg Med Chem Lett 28: 809-813 (2018)
Article DOI: 10.1016/j.bmcl.2017.11.016
BindingDB Entry DOI: 10.7270/Q2TH8Q90