BDBM50454592 CHEMBL4210774
SMILES: CC(C)Oc1ccc(cc1)C(=O)Nc1ccc(Cl)cc1C(O)=O
InChI Key: InChIKey=IKSSDTQHCBFPCN-UHFFFAOYSA-N
Data: 1 IC50
Activity Spreadsheet -- Enzyme Inhibition Constant Data from BindingDB
Found 1 hit for monomerid = 50454592
Trg + Lig
Ki
nM
ΔG°
kcal/mole
IC50
nM
Kd
nM
EC50/IC50
nM
koff
s-1
kon
M-1s-1
pHTemp
°C
Plasminogen activator inhibitor-1
(Homo sapiens (Human))
BDBM50454592
(CHEMBL4210774)
Show SMILES CC(C)Oc1ccc(cc1)C(=O)Nc1ccc(Cl)cc1C(O)=O
Show InChI InChI=1S/C17H16ClNO4/c1-10(2)23-13-6-3-11(4-7-13)16(20)19-15-8-5-12(18)9-14(15)17(21)22/h3-10H,1-2H3,(H,19,20)(H,21,22)
Reactome pathway
n/an/a>1.00E+4n/an/an/an/an/an/a
Hamari Chemicals, Ltd.
Curated by ChEMBL
Assay Description
Inhibition of human PAI-1 assessed as remaining enzyme activity by measuring p-nitroaniline release pre-incubated for 15 mins before 2 nM Spectrozyme...
Bioorg Med Chem Lett 28: 809-813 (2018)
Article DOI: 10.1016/j.bmcl.2017.11.016
BindingDB Entry DOI: 10.7270/Q2TH8Q90