BDBM50455440 CHEMBL2367850
SMILES: [H][C@](O)(C[C@@]([H])(Cc1ccccc1)C(=O)N[C@H](CO)c1ccccc1)[C@]([H])(Cc1ccccc1)NC(=O)OC(C)(C)C
InChI Key: InChIKey=XFGHFQQIXBYKAU-AIQXTLEGSA-N
Data: 2 IC50
Activity Spreadsheet -- Enzyme Inhibition Constant Data from BindingDB
Found 2 hits for monomerid = 50455440
Trg + Lig
Ki
nM
ΔG°
kcal/mole
IC50
nM
Kd
nM
EC50/IC50
nM
koff
s-1
kon
M-1s-1
pHTemp
°C
Human immunodeficiency virus type 1 protease
(Human immunodeficiency virus type 1)
BDBM50455440
(CHEMBL2367850)
Show SMILES [H][C@](O)(C[C@@]([H])(Cc1ccccc1)C(=O)N[C@H](CO)c1ccccc1)[C@]([H])(Cc1ccccc1)NC(=O)OC(C)(C)C
Show InChI InChI=1S/C32H40N2O5/c1-32(2,3)39-31(38)34-27(20-24-15-9-5-10-16-24)29(36)21-26(19-23-13-7-4-8-14-23)30(37)33-28(22-35)25-17-11-6-12-18-25/h4-18,26-29,35-36H,19-22H2,1-3H3,(H,33,37)(H,34,38)/t26-,27+,28-,29+/m1/s1
n/an/a 39n/an/an/an/an/an/a
Eli Lilly and Company
Curated by ChEMBL
Assay Description
Inhibitory activity against HIV-1 protease.
J Med Chem 43: 3020-32 (2000)
BindingDB Entry DOI: 10.7270/Q2HM59P2
Human immunodeficiency virus type 1 protease
(Human immunodeficiency virus type 1)
BDBM50455440
(CHEMBL2367850)
Show SMILES [H][C@](O)(C[C@@]([H])(Cc1ccccc1)C(=O)N[C@H](CO)c1ccccc1)[C@]([H])(Cc1ccccc1)NC(=O)OC(C)(C)C
Show InChI InChI=1S/C32H40N2O5/c1-32(2,3)39-31(38)34-27(20-24-15-9-5-10-16-24)29(36)21-26(19-23-13-7-4-8-14-23)30(37)33-28(22-35)25-17-11-6-12-18-25/h4-18,26-29,35-36H,19-22H2,1-3H3,(H,33,37)(H,34,38)/t26-,27+,28-,29+/m1/s1
n/an/a 39n/an/an/an/an/an/a
Universidad de Alcal£
Curated by ChEMBL
Assay Description
Inhibitory activity against HIV-1 protease.
J Med Chem 41: 836-52 (1998)
Article DOI: 10.1021/jm970535b
BindingDB Entry DOI: 10.7270/Q21R6RTN