BDBM50455974 CHEMBL544244
SMILES: Cl.COc1ccccc1C(=O)NC(=O)NC1CC2CCC(C1)N2C
InChI Key: InChIKey=UAAVYIRLWMBEQI-UHFFFAOYSA-N
Data: 1 Kd
Activity Spreadsheet -- Enzyme Inhibition Constant Data from BindingDB
Found 1 hit for monomerid = 50455974
Trg + Lig
Ki
nM
ΔG°
kcal/mole
IC50
nM
Kd
nM
EC50/IC50
nM
koff
s-1
kon
M-1s-1
pHTemp
°C
Serotonin 3a (5-HT3a)/3b (5-HT3b) receptor
(Rattus norvegicus-RAT)
BDBM50455974
(CHEMBL544244)
Show SMILES Cl.COc1ccccc1C(=O)NC(=O)NC1CC2CCC(C1)N2C |TLB:14:15:22:18.19|
Show InChI InChI=1S/C17H23N3O3.ClH/c1-20-12-7-8-13(20)10-11(9-12)18-17(22)19-16(21)14-5-3-4-6-15(14)23-2;/h3-6,11-13H,7-10H2,1-2H3,(H2,18,19,21,22);1H
n/an/an/a 2.5n/an/an/an/an/a
Wyeth Research
Curated by ChEMBL
Assay Description
In vitro antagonism of the 5-HT-3 receptor determined by inhibition of 5-HT-induced depolarization of the isolated rat vagus nerve.
J Med Chem 35: 1515-20 (1992)
BindingDB Entry DOI: 10.7270/Q24B32SK