BDBM50460740 CHEMBL4228404
SMILES: CN(C)c1ccc(cc1)-c1nnc2sc(\C=C\c3ccco3)nn12
InChI Key: InChIKey=HYGNBMVDUWDIPJ-MDZDMXLPSA-N
Data: 2 IC50  1 Kd
Activity Spreadsheet -- Enzyme Inhibition Constant Data from BindingDB
Found 3 hits for monomerid = 50460740
Trg + Lig
Ki
nM
ΔG°
kcal/mole
IC50
nM
Kd
nM
EC50/IC50
nM
koff
s-1
kon
M-1s-1
pHTemp
°C
Histone-lysine N-methyltransferase, H3 lysine-79 specific
(Homo sapiens (Human))
BDBM50460740
(CHEMBL4228404)
Show SMILES CN(C)c1ccc(cc1)-c1nnc2sc(\C=C\c3ccco3)nn12
Show InChI InChI=1S/C17H15N5OS/c1-21(2)13-7-5-12(6-8-13)16-18-19-17-22(16)20-15(24-17)10-9-14-4-3-11-23-14/h3-11H,1-2H3/b10-9+
n/an/a 2.09E+4n/an/an/an/an/an/a
University of Science and Technology of China
Curated by ChEMBL
Assay Description
Inhibition of recombinant human His6-SUMO tagged DOT1L (1 to 416 residues) expressed in Escherichia coli BL21(DE3) using oligonucleosome as substrate...
Bioorg Med Chem 26: 1751-1758 (2018)
Article DOI: 10.1016/j.bmc.2018.02.020
BindingDB Entry DOI: 10.7270/Q2319ZHM
Histone-lysine N-methyltransferase, H3 lysine-79 specific
(Homo sapiens (Human))
BDBM50460740
(CHEMBL4228404)
Show SMILES CN(C)c1ccc(cc1)-c1nnc2sc(\C=C\c3ccco3)nn12
Show InChI InChI=1S/C17H15N5OS/c1-21(2)13-7-5-12(6-8-13)16-18-19-17-22(16)20-15(24-17)10-9-14-4-3-11-23-14/h3-11H,1-2H3/b10-9+
n/an/a 2.09E+4n/an/an/an/an/an/a
University of Science and Technology of China
Curated by ChEMBL
Assay Description
Inhibition of recombinant human His6-SUMO tagged DOT1L (1 to 416 residues) expressed in Escherichia coli BL21(DE3) using oligonucleosome as substrate...
Bioorg Med Chem 26: 1751-1758 (2018)
Article DOI: 10.1016/j.bmc.2018.02.020
BindingDB Entry DOI: 10.7270/Q2319ZHM
Histone-lysine N-methyltransferase, H3 lysine-79 specific
(Homo sapiens (Human))
BDBM50460740
(CHEMBL4228404)
Show SMILES CN(C)c1ccc(cc1)-c1nnc2sc(\C=C\c3ccco3)nn12
Show InChI InChI=1S/C17H15N5OS/c1-21(2)13-7-5-12(6-8-13)16-18-19-17-22(16)20-15(24-17)10-9-14-4-3-11-23-14/h3-11H,1-2H3/b10-9+
n/an/an/a 9.30E+3n/an/an/an/an/a
University of Science and Technology of China
Curated by ChEMBL
Assay Description
Binding affinity to recombinant human His6-SUMO tagged DOT1L (1 to 416 residues) expressed in Escherichia coli BL21(DE3) by surface plasmon resonance...
Bioorg Med Chem 26: 1751-1758 (2018)
Article DOI: 10.1016/j.bmc.2018.02.020
BindingDB Entry DOI: 10.7270/Q2319ZHM