BDBM50460776 CHEMBL4227538
SMILES: Cc1cn2c(cnc2c(Nc2cc(Cc3nccs3)ns2)n1)-c1cn[nH]c1
InChI Key: InChIKey=FDAYFBMHMNYSCR-UHFFFAOYSA-N
Data: 2 IC50  1 EC50
Activity Spreadsheet -- Enzyme Inhibition Constant Data from BindingDB
Found 3 hits for monomerid = 50460776
Trg + Lig
Ki
nM
ΔG°
kcal/mole
IC50
nM
Kd
nM
EC50/IC50
nM
koff
s-1
kon
M-1s-1
pHTemp
°C
Aurora kinase B
(Homo sapiens (Human))
BDBM50460776
(CHEMBL4227538)
Show SMILES Cc1cn2c(cnc2c(Nc2cc(Cc3nccs3)ns2)n1)-c1cn[nH]c1
Show InChI InChI=1S/C17H14N8S2/c1-10-9-25-13(11-6-20-21-7-11)8-19-17(25)16(22-10)23-15-5-12(24-27-15)4-14-18-2-3-26-14/h2-3,5-9H,4H2,1H3,(H,20,21)(H,22,23)
Reactome pathway
n/an/a<13n/an/an/an/an/an/a
Merck & Co.
Curated by ChEMBL
Assay Description
Inhibition of Aurora B (unknown origin) using Tamra-PKAtide as substrate by fluorescence polarization assay
Bioorg Med Chem Lett 28: 1397-1403 (2018)
Article DOI: 10.1016/j.bmcl.2018.02.037
BindingDB Entry DOI: 10.7270/Q2K35X91
Aurora kinase B
(Homo sapiens (Human))
BDBM50460776
(CHEMBL4227538)
Show SMILES Cc1cn2c(cnc2c(Nc2cc(Cc3nccs3)ns2)n1)-c1cn[nH]c1
Show InChI InChI=1S/C17H14N8S2/c1-10-9-25-13(11-6-20-21-7-11)8-19-17(25)16(22-10)23-15-5-12(24-27-15)4-14-18-2-3-26-14/h2-3,5-9H,4H2,1H3,(H,20,21)(H,22,23)
Reactome pathway
n/an/an/an/a 170n/an/an/an/a
Merck & Co.
Curated by ChEMBL
Assay Description
Inhibition of Aurora B in human HCT116 cells assessed as reduction in phosphorylation of Histone H3 at Ser10 residue incubated for 1 hr by Hoechst 33...
Bioorg Med Chem Lett 28: 1397-1403 (2018)
Article DOI: 10.1016/j.bmcl.2018.02.037
BindingDB Entry DOI: 10.7270/Q2K35X91
Aurora kinase A
(Homo sapiens (Human))
BDBM50460776
(CHEMBL4227538)
Show SMILES Cc1cn2c(cnc2c(Nc2cc(Cc3nccs3)ns2)n1)-c1cn[nH]c1
Show InChI InChI=1S/C17H14N8S2/c1-10-9-25-13(11-6-20-21-7-11)8-19-17(25)16(22-10)23-15-5-12(24-27-15)4-14-18-2-3-26-14/h2-3,5-9H,4H2,1H3,(H,20,21)(H,22,23)
NCI pathway
Reactome pathway
n/an/a<4n/an/an/an/an/an/a
Merck & Co.
Curated by ChEMBL
Assay Description
Inhibition of Aurora A (unknown origin) using Tamra-PKAtide as substrate by fluorescence polarization assay
Bioorg Med Chem Lett 28: 1397-1403 (2018)
Article DOI: 10.1016/j.bmcl.2018.02.037
BindingDB Entry DOI: 10.7270/Q2K35X91