BDBM50460789 CHEMBL4228308
SMILES: Cc1cccc(Cc2cc(Nc3nc(C)cn4c(cnc34)-c3cn[nH]c3)sn2)n1
InChI Key: InChIKey=BJBBWOSJWQHASB-UHFFFAOYSA-N
Data: 2 IC50  1 EC50
Activity Spreadsheet -- Enzyme Inhibition Constant Data from BindingDB
Found 3 hits for monomerid = 50460789
Trg + Lig
Ki
nM
ΔG°
kcal/mole
IC50
nM
Kd
nM
EC50/IC50
nM
koff
s-1
kon
M-1s-1
pHTemp
°C
Aurora kinase A
(Homo sapiens (Human))
BDBM50460789
(CHEMBL4228308)
Show SMILES Cc1cccc(Cc2cc(Nc3nc(C)cn4c(cnc34)-c3cn[nH]c3)sn2)n1
Show InChI InChI=1S/C20H18N8S/c1-12-4-3-5-15(24-12)6-16-7-18(29-27-16)26-19-20-21-10-17(14-8-22-23-9-14)28(20)11-13(2)25-19/h3-5,7-11H,6H2,1-2H3,(H,22,23)(H,25,26)
NCI pathway
Reactome pathway
n/an/a<4n/an/an/an/an/an/a
Merck & Co.
Curated by ChEMBL
Assay Description
Inhibition of Aurora A (unknown origin) using Tamra-PKAtide as substrate by fluorescence polarization assay
Bioorg Med Chem Lett 28: 1397-1403 (2018)
Article DOI: 10.1016/j.bmcl.2018.02.037
BindingDB Entry DOI: 10.7270/Q2K35X91
Aurora kinase B
(Homo sapiens (Human))
BDBM50460789
(CHEMBL4228308)
Show SMILES Cc1cccc(Cc2cc(Nc3nc(C)cn4c(cnc34)-c3cn[nH]c3)sn2)n1
Show InChI InChI=1S/C20H18N8S/c1-12-4-3-5-15(24-12)6-16-7-18(29-27-16)26-19-20-21-10-17(14-8-22-23-9-14)28(20)11-13(2)25-19/h3-5,7-11H,6H2,1-2H3,(H,22,23)(H,25,26)
Reactome pathway
n/an/a<13n/an/an/an/an/an/a
Merck & Co.
Curated by ChEMBL
Assay Description
Inhibition of Aurora B (unknown origin) using Tamra-PKAtide as substrate by fluorescence polarization assay
Bioorg Med Chem Lett 28: 1397-1403 (2018)
Article DOI: 10.1016/j.bmcl.2018.02.037
BindingDB Entry DOI: 10.7270/Q2K35X91
Aurora kinase B
(Homo sapiens (Human))
BDBM50460789
(CHEMBL4228308)
Show SMILES Cc1cccc(Cc2cc(Nc3nc(C)cn4c(cnc34)-c3cn[nH]c3)sn2)n1
Show InChI InChI=1S/C20H18N8S/c1-12-4-3-5-15(24-12)6-16-7-18(29-27-16)26-19-20-21-10-17(14-8-22-23-9-14)28(20)11-13(2)25-19/h3-5,7-11H,6H2,1-2H3,(H,22,23)(H,25,26)
Reactome pathway
n/an/an/an/a 88n/an/an/an/a
Merck & Co.
Curated by ChEMBL
Assay Description
Inhibition of Aurora B in human HCT116 cells assessed as reduction in phosphorylation of Histone H3 at Ser10 residue incubated for 1 hr by Hoechst 33...
Bioorg Med Chem Lett 28: 1397-1403 (2018)
Article DOI: 10.1016/j.bmcl.2018.02.037
BindingDB Entry DOI: 10.7270/Q2K35X91