BDBM50461 1-[2-[(2-fluorophenyl)methoxy]phenyl]-N-methyl-methanamine;hydrochloride::1-[2-[(2-fluorophenyl)methoxy]phenyl]-N-methylmethanamine;hydrochloride::MLS000676047::SMR000296059::[2-(2-fluorobenzyl)oxybenzyl]-methyl-amine;hydrochloride::cid_2972624::{2-[(2-fluorobenzyl)oxy]benzyl}methylamine hydrochloride
SMILES: CNCc1ccccc1OCc1ccccc1F
InChI Key: InChIKey=IAQFPBXPRHVJOS-UHFFFAOYSA-N
Data: 1 IC50
Activity Spreadsheet -- Enzyme Inhibition Constant Data from BindingDB
Found 1 hit for monomerid = 50461
Trg + Lig
Ki
nM
ΔG°
kcal/mole
IC50
nM
Kd
nM
EC50/IC50
nM
koff
s-1
kon
M-1s-1
pHTemp
°C
Induced myeloid leukemia cell differentiation protein Mcl-1
(Homo sapiens (Human))
BDBM50461
(1-[2-[(2-fluorophenyl)methoxy]phenyl]-N-methyl-met...)
Show SMILES CNCc1ccccc1OCc1ccccc1F
Show InChI InChI=1S/C15H16FNO/c1-17-10-12-6-3-5-9-15(12)18-11-13-7-2-4-8-14(13)16/h2-9,17H,10-11H2,1H3
NCI pathway
PCBioAssay
n/an/a 557n/an/an/an/an/an/a
Emory University Molecular Libraries Screening Center
Curated by PubChem BioAssay
Assay Description
NIH Molecular Libraries Screening Centers Network [MLSCN] Emory Chemical Biology Discovery Center in MLSCN Assay provider: Nikolovska-Coleska, Univer...
PubChem Bioassay (2008)
BindingDB Entry DOI: 10.7270/Q23X8539