BDBM50461643 CHEMBL4225764
SMILES: COc1ccc(cc1OC)C(=O)N1CCC(NC(=O)c2ccccc2Cl)C(C1)c1ccccc1
InChI Key: InChIKey=BJBRZZQBAKRNIU-UHFFFAOYSA-N
Data: 1 IC50
Activity Spreadsheet -- Enzyme Inhibition Constant Data from BindingDB
Found 1 hit for monomerid = 50461643
Trg + Lig
Ki
nM
ΔG°
kcal/mole
IC50
nM
Kd
nM
EC50/IC50
nM
koff
s-1
kon
M-1s-1
pHTemp
°C
Serine palmitoyltransferase 2
(Homo sapiens (Human))
BDBM50461643
(CHEMBL4225764)
Show SMILES COc1ccc(cc1OC)C(=O)N1CCC(NC(=O)c2ccccc2Cl)C(C1)c1ccccc1
Show InChI InChI=1S/C27H27ClN2O4/c1-33-24-13-12-19(16-25(24)34-2)27(32)30-15-14-23(21(17-30)18-8-4-3-5-9-18)29-26(31)20-10-6-7-11-22(20)28/h3-13,16,21,23H,14-15,17H2,1-2H3,(H,29,31)
Reactome pathway
n/an/a 1.20n/an/an/an/an/an/a
Takeda Pharmaceutical Company Limited
Curated by ChEMBL
Assay Description
Inhibition of human SPT2 transfected in Freestyle293 cells using L-serine and palmitoyl-CoA as substrate preincubated for 60 mins followed by substra...
Bioorg Med Chem 26: 2452-2465 (2018)
Article DOI: 10.1016/j.bmc.2018.04.008
BindingDB Entry DOI: 10.7270/Q2RF5XNH