BDBM50463136 CHEMBL4248116
SMILES: c1coc(c1)-c1cc(cc(n1)-c1ccc(cc1)-c1nccs1)-c1nccs1
InChI Key: InChIKey=GRWNTNRNEZXALW-UHFFFAOYSA-N
Data: 1 IC50
Activity Spreadsheet -- Enzyme Inhibition Constant Data from BindingDB
Found 1 hit for monomerid = 50463136
Trg + Lig
Ki
nM
ΔG°
kcal/mole
IC50
nM
Kd
nM
EC50/IC50
nM
koff
s-1
kon
M-1s-1
pHTemp
°C
Myc proto-oncogene protein
(Homo sapiens (Human))
BDBM50463136
(CHEMBL4248116)
Show SMILES c1coc(c1)-c1cc(cc(n1)-c1ccc(cc1)-c1nccs1)-c1nccs1
Show InChI InChI=1S/C21H13N3OS2/c1-2-19(25-9-1)18-13-16(21-23-8-11-27-21)12-17(24-18)14-3-5-15(6-4-14)20-22-7-10-26-20/h1-13H
Reactome pathway
n/an/a>1.00E+5n/an/an/an/an/an/a
The Scripps Research Institute
Curated by ChEMBL
Assay Description
Binding affinity to ATG-Myc (unknown origin) expressed in CEF cells assessed as inhibition of microtumor formation
Bioorg Med Chem 26: 4234-4239 (2018)
Article DOI: 10.1016/j.bmc.2018.07.019
BindingDB Entry DOI: 10.7270/Q2FJ2KDB