BDBM50465872 CHEMBL4287881
SMILES: Fc1ccc2c(c1)oc(cc2=O)-c1ccc(OCCCc2cn(CCOCCOCCOc3ccc(cc3)-c3cc(=O)c4ccccc4o3)nn2)cc1
InChI Key: InChIKey=KHXCAELRMQZJBJ-UHFFFAOYSA-N
Data: 4 EC50
Activity Spreadsheet -- Enzyme Inhibition Constant Data from BindingDB
Found 4 hits for monomerid = 50465872
Trg + Lig
Ki
nM
ΔG°
kcal/mole
IC50
nM
Kd
nM
EC50/IC50
nM
koff
s-1
kon
M-1s-1
pHTemp
°C
Multidrug resistance protein 1/Multidrug resistance associated protein 1
(Homo sapiens (Human))
BDBM50465872
(CHEMBL4287881)
Show SMILES Fc1ccc2c(c1)oc(cc2=O)-c1ccc(OCCCc2cn(CCOCCOCCOc3ccc(cc3)-c3cc(=O)c4ccccc4o3)nn2)cc1
Show InChI InChI=1S/C41H36FN3O8/c42-30-11-16-35-37(47)26-40(53-41(35)24-30)29-7-12-32(13-8-29)50-18-3-4-31-27-45(44-43-31)17-19-48-20-21-49-22-23-51-33-14-9-28(10-15-33)39-25-36(46)34-5-1-2-6-38(34)52-39/h1-2,5-16,24-27H,3-4,17-23H2
n/an/an/an/a 208n/an/an/an/a
Hong Kong Polytechnic University
Curated by ChEMBL
Assay Description
Inhibition of MRP1 in human 2008/MRP1 cells assessed as potentiation of doxorubicin-induced cytotoxicity by measuring reduction in cell survival afte...
J Med Chem 61: 9931-9951 (2018)
Article DOI: 10.1021/acs.jmedchem.8b00834
BindingDB Entry DOI: 10.7270/Q2RX9FRD
Multidrug resistance protein 1/Multidrug resistance associated protein 1
(Homo sapiens (Human))
BDBM50465872
(CHEMBL4287881)
Show SMILES Fc1ccc2c(c1)oc(cc2=O)-c1ccc(OCCCc2cn(CCOCCOCCOc3ccc(cc3)-c3cc(=O)c4ccccc4o3)nn2)cc1
Show InChI InChI=1S/C41H36FN3O8/c42-30-11-16-35-37(47)26-40(53-41(35)24-30)29-7-12-32(13-8-29)50-18-3-4-31-27-45(44-43-31)17-19-48-20-21-49-22-23-51-33-14-9-28(10-15-33)39-25-36(46)34-5-1-2-6-38(34)52-39/h1-2,5-16,24-27H,3-4,17-23H2
n/an/an/an/a 255n/an/an/an/a
Hong Kong Polytechnic University
Curated by ChEMBL
Assay Description
Inhibition of P-gp (unknown origin) expressed in human LCC6MDR cells assessed as reversal of paclitaxel resistance after 5 days by MTS/PMS assay
J Med Chem 62: 8578-8608 (2019)
Article DOI: 10.1021/acs.jmedchem.9b00963
ATP-binding cassette sub-family G member 2
(Homo sapiens (Human))
BDBM50465872
(CHEMBL4287881)
Show SMILES Fc1ccc2c(c1)oc(cc2=O)-c1ccc(OCCCc2cn(CCOCCOCCOc3ccc(cc3)-c3cc(=O)c4ccccc4o3)nn2)cc1
Show InChI InChI=1S/C41H36FN3O8/c42-30-11-16-35-37(47)26-40(53-41(35)24-30)29-7-12-32(13-8-29)50-18-3-4-31-27-45(44-43-31)17-19-48-20-21-49-22-23-51-33-14-9-28(10-15-33)39-25-36(46)34-5-1-2-6-38(34)52-39/h1-2,5-16,24-27H,3-4,17-23H2
NCI pathway
Reactome pathway
n/an/an/an/a 7.40n/an/an/an/a
Hong Kong Polytechnic University
Curated by ChEMBL
Assay Description
Inhibition of BCRP in human MCF7/MX100 cells assessed as reversal of topotecan resistance after 5 days by MTS/PMS assay
J Med Chem 62: 8578-8608 (2019)
Article DOI: 10.1021/acs.jmedchem.9b00963
ATP-binding cassette sub-family G member 2
(Homo sapiens (Human))
BDBM50465872
(CHEMBL4287881)
Show SMILES Fc1ccc2c(c1)oc(cc2=O)-c1ccc(OCCCc2cn(CCOCCOCCOc3ccc(cc3)-c3cc(=O)c4ccccc4o3)nn2)cc1
Show InChI InChI=1S/C41H36FN3O8/c42-30-11-16-35-37(47)26-40(53-41(35)24-30)29-7-12-32(13-8-29)50-18-3-4-31-27-45(44-43-31)17-19-48-20-21-49-22-23-51-33-14-9-28(10-15-33)39-25-36(46)34-5-1-2-6-38(34)52-39/h1-2,5-16,24-27H,3-4,17-23H2
NCI pathway
Reactome pathway
n/an/an/an/a 24n/an/an/an/a
Hong Kong Polytechnic University
Curated by ChEMBL
Assay Description
Inhibition of BCRP (unknown origin) transfected in HEK293/R2 cells assessed as reversal of topotecan resistance after 5 days by MTS/PMS assay
J Med Chem 62: 8578-8608 (2019)
Article DOI: 10.1021/acs.jmedchem.9b00963