BDBM50465961 CHEMBL4279510
SMILES: [H][C@]1(OC(=C[C@H](O)[C@H]1NC(C)=O)C(O)=O)[C@H](O)[C@H](O)CNC(=O)c1ccc(NC(C)=O)cc1
InChI Key: InChIKey=BNZQQXCHSCHFQT-QBBQCFRVSA-N
Data: 4 IC50
Activity Spreadsheet -- Enzyme Inhibition Constant Data from BindingDB
Found 4 hits for monomerid = 50465961
Trg + Lig
Ki
nM
ΔG°
kcal/mole
IC50
nM
Kd
nM
EC50/IC50
nM
koff
s-1
kon
M-1s-1
pHTemp
°C
Sialidase 1
(Homo sapiens (Human))
BDBM50465961
(CHEMBL4279510)
Show SMILES [H][C@]1(OC(=C[C@H](O)[C@H]1NC(C)=O)C(O)=O)[C@H](O)[C@H](O)CNC(=O)c1ccc(NC(C)=O)cc1 |r,c:3|
Show InChI InChI=1S/C20H25N3O9/c1-9(24)22-12-5-3-11(4-6-12)19(29)21-8-14(27)17(28)18-16(23-10(2)25)13(26)7-15(32-18)20(30)31/h3-7,13-14,16-18,26-28H,8H2,1-2H3,(H,21,29)(H,22,24)(H,23,25)(H,30,31)/t13-,14+,16+,17+,18+/m0/s1
Reactome pathway
n/an/a 1.90E+3n/an/an/an/an/an/a
University of Alberta
Curated by ChEMBL
Assay Description
Inhibition of human His6-tagged NEU1 expressed in HEK293 cells using 4MU-NANA as substrate preincubated for 15 mins followed by substrate addition an...
J Med Chem 61: 11261-11279 (2018)
Article DOI: 10.1021/acs.jmedchem.8b01411
BindingDB Entry DOI: 10.7270/Q2GF0X5V
Sialidase 2
(Homo sapiens (Human))
BDBM50465961
(CHEMBL4279510)
Show SMILES [H][C@]1(OC(=C[C@H](O)[C@H]1NC(C)=O)C(O)=O)[C@H](O)[C@H](O)CNC(=O)c1ccc(NC(C)=O)cc1 |r,c:3|
Show InChI InChI=1S/C20H25N3O9/c1-9(24)22-12-5-3-11(4-6-12)19(29)21-8-14(27)17(28)18-16(23-10(2)25)13(26)7-15(32-18)20(30)31/h3-7,13-14,16-18,26-28H,8H2,1-2H3,(H,21,29)(H,22,24)(H,23,25)(H,30,31)/t13-,14+,16+,17+,18+/m0/s1
Reactome pathway
n/an/a 9.00E+4n/an/an/an/an/an/a
University of Alberta
Curated by ChEMBL
Assay Description
Inhibition of N-terminal MBP-fused human NEU2 expressed in Escherichia coli using 4MU-NANA as substrate preincubated for 15 mins followed by substrat...
J Med Chem 61: 11261-11279 (2018)
Article DOI: 10.1021/acs.jmedchem.8b01411
BindingDB Entry DOI: 10.7270/Q2GF0X5V
Sialidase 4
(Homo sapiens (Human))
BDBM50465961
(CHEMBL4279510)
Show SMILES [H][C@]1(OC(=C[C@H](O)[C@H]1NC(C)=O)C(O)=O)[C@H](O)[C@H](O)CNC(=O)c1ccc(NC(C)=O)cc1 |r,c:3|
Show InChI InChI=1S/C20H25N3O9/c1-9(24)22-12-5-3-11(4-6-12)19(29)21-8-14(27)17(28)18-16(23-10(2)25)13(26)7-15(32-18)20(30)31/h3-7,13-14,16-18,26-28H,8H2,1-2H3,(H,21,29)(H,22,24)(H,23,25)(H,30,31)/t13-,14+,16+,17+,18+/m0/s1
Reactome pathway
n/an/a 2.40E+4n/an/an/an/an/an/a
University of Alberta
Curated by ChEMBL
Assay Description
Inhibition of MBP-fused human NEU4 expressed in Escherichia coli using 4MU-NANA as substrate preincubated for 15 mins followed by substrate addition ...
J Med Chem 61: 11261-11279 (2018)
Article DOI: 10.1021/acs.jmedchem.8b01411
BindingDB Entry DOI: 10.7270/Q2GF0X5V
Sialidase 3
(Homo sapiens (Human))
BDBM50465961
(CHEMBL4279510)
Show SMILES [H][C@]1(OC(=C[C@H](O)[C@H]1NC(C)=O)C(O)=O)[C@H](O)[C@H](O)CNC(=O)c1ccc(NC(C)=O)cc1 |r,c:3|
Show InChI InChI=1S/C20H25N3O9/c1-9(24)22-12-5-3-11(4-6-12)19(29)21-8-14(27)17(28)18-16(23-10(2)25)13(26)7-15(32-18)20(30)31/h3-7,13-14,16-18,26-28H,8H2,1-2H3,(H,21,29)(H,22,24)(H,23,25)(H,30,31)/t13-,14+,16+,17+,18+/m0/s1
Reactome pathway
n/an/a 7.20E+3n/an/an/an/an/an/a
University of Alberta
Curated by ChEMBL
Assay Description
Inhibition of N-terminal MBP-fused human NEU3 expressed in Escherichia coli using 4MU-NANA as substrate preincubated for 15 mins followed by substrat...
J Med Chem 61: 11261-11279 (2018)
Article DOI: 10.1021/acs.jmedchem.8b01411
BindingDB Entry DOI: 10.7270/Q2GF0X5V