BDBM50468395 CHEMBL4294625
SMILES: CNC(=O)n1ccc2cc(Oc3ccnc(NC(=O)c4ccc(cc4)C4CCN(CCO)CC4)c3)c(OCCO)cc12
InChI Key: InChIKey=XSFHSBDHUMMKQC-UHFFFAOYSA-N
Data: 4 IC50
Activity Spreadsheet -- Enzyme Inhibition Constant Data from BindingDB
Found 4 hits for monomerid = 50468395
Trg + Lig
Ki
nM
ΔG°
kcal/mole
IC50
nM
Kd
nM
EC50/IC50
nM
koff
s-1
kon
M-1s-1
pHTemp
°C
Vascular endothelial growth factor receptor 2
(Homo sapiens (Human))
BDBM50468395
(CHEMBL4294625)
Show SMILES CNC(=O)n1ccc2cc(Oc3ccnc(NC(=O)c4ccc(cc4)C4CCN(CCO)CC4)c3)c(OCCO)cc12
Show InChI InChI=1S/C31H35N5O6/c1-32-31(40)36-13-9-24-18-28(27(20-26(24)36)41-17-16-38)42-25-6-10-33-29(19-25)34-30(39)23-4-2-21(3-5-23)22-7-11-35(12-8-22)14-15-37/h2-6,9-10,13,18-20,22,37-38H,7-8,11-12,14-17H2,1H3,(H,32,40)(H,33,34,39)
NCI pathway
Reactome pathway
n/an/a 16n/an/an/an/an/an/a
Chinese Academy of Sciences
Curated by ChEMBL
Assay Description
Inhibition of human N-terminal GST-tagged VEGFR2 (790 to 1356 residues) cytoplasmic domain expressed in baculovirus expression system after 60 mins b...
Eur J Med Chem 154: 9-28 (2018)
Article DOI: 10.1016/j.ejmech.2018.05.005
BindingDB Entry DOI: 10.7270/Q2736TM3
Fibroblast growth factor receptor 1
(Homo sapiens (Human))
BDBM50468395
(CHEMBL4294625)
Show SMILES CNC(=O)n1ccc2cc(Oc3ccnc(NC(=O)c4ccc(cc4)C4CCN(CCO)CC4)c3)c(OCCO)cc12
Show InChI InChI=1S/C31H35N5O6/c1-32-31(40)36-13-9-24-18-28(27(20-26(24)36)41-17-16-38)42-25-6-10-33-29(19-25)34-30(39)23-4-2-21(3-5-23)22-7-11-35(12-8-22)14-15-37/h2-6,9-10,13,18-20,22,37-38H,7-8,11-12,14-17H2,1H3,(H,32,40)(H,33,34,39)
NCI pathway
Reactome pathway
n/an/a 0.5n/an/an/an/an/an/a
Chinese Academy of Sciences
Curated by ChEMBL
Assay Description
Inhibition of human N-terminal GST-tagged FGFR1 (398 to 822 residues) cytoplasmic domain expressed in baculovirus expression system after 60 mins by ...
Eur J Med Chem 154: 9-28 (2018)
Article DOI: 10.1016/j.ejmech.2018.05.005
BindingDB Entry DOI: 10.7270/Q2736TM3
Fibroblast growth factor receptor 2
(Homo sapiens (Human))
BDBM50468395
(CHEMBL4294625)
Show SMILES CNC(=O)n1ccc2cc(Oc3ccnc(NC(=O)c4ccc(cc4)C4CCN(CCO)CC4)c3)c(OCCO)cc12
Show InChI InChI=1S/C31H35N5O6/c1-32-31(40)36-13-9-24-18-28(27(20-26(24)36)41-17-16-38)42-25-6-10-33-29(19-25)34-30(39)23-4-2-21(3-5-23)22-7-11-35(12-8-22)14-15-37/h2-6,9-10,13,18-20,22,37-38H,7-8,11-12,14-17H2,1H3,(H,32,40)(H,33,34,39)
NCI pathway
Reactome pathway
n/an/a 0.5n/an/an/an/an/an/a
Chinese Academy of Sciences
Curated by ChEMBL
Assay Description
Inhibition of human N-terminal GST-tagged FGFR2 (399 to 821 residues) cytoplasmic domain expressed in baculovirus expression system after 60 mins by ...
Eur J Med Chem 154: 9-28 (2018)
Article DOI: 10.1016/j.ejmech.2018.05.005
BindingDB Entry DOI: 10.7270/Q2736TM3
Fibroblast growth factor receptor 3
(Homo sapiens (Human))
BDBM50468395
(CHEMBL4294625)
Show SMILES CNC(=O)n1ccc2cc(Oc3ccnc(NC(=O)c4ccc(cc4)C4CCN(CCO)CC4)c3)c(OCCO)cc12
Show InChI InChI=1S/C31H35N5O6/c1-32-31(40)36-13-9-24-18-28(27(20-26(24)36)41-17-16-38)42-25-6-10-33-29(19-25)34-30(39)23-4-2-21(3-5-23)22-7-11-35(12-8-22)14-15-37/h2-6,9-10,13,18-20,22,37-38H,7-8,11-12,14-17H2,1H3,(H,32,40)(H,33,34,39)
Reactome pathway
n/an/a 0.5n/an/an/an/an/an/a
Chinese Academy of Sciences
Curated by ChEMBL
Assay Description
Inhibition of human N-terminal GST-tagged FGFR3 (436 to 806 residues) cytoplasmic domain expressed in baculovirus expression system after 60 mins by ...
Eur J Med Chem 154: 9-28 (2018)
Article DOI: 10.1016/j.ejmech.2018.05.005
BindingDB Entry DOI: 10.7270/Q2736TM3