null
SMILES: CC(C)(C)c1cc(\C=C\C(=O)NCCC2CCN(Cc3ccccc3F)CC2)cc(c1O)C(C)(C)C
InChI Key: InChIKey=RXSZVSISAHLZBD-VAWYXSNFSA-N
Activity Spreadsheet -- Enzyme Inhibition Constant Data from BindingDB
Found 5 hits for monomerid = 50469009
Trg + Lig
Ki
nM
ΔG°
kcal/mole
IC50
nM
Kd
nM
EC50/IC50
nM
koff
s-1
kon
M-1s-1
pHTemp
°C
Acetylcholinesterase
(Homo sapiens (Human))
BDBM50469009
(CHEMBL4292766)
Show SMILES CC(C)(C)c1cc(\C=C\C(=O)NCCC2CCN(Cc3ccccc3F)CC2)cc(c1O)C(C)(C)C
Show InChI InChI=1S/C31H43FN2O2/c1-30(2,3)25-19-23(20-26(29(25)36)31(4,5)6)11-12-28(35)33-16-13-22-14-17-34(18-15-22)21-24-9-7-8-10-27(24)32/h7-12,19-20,22,36H,13-18,21H2,1-6H3,(H,33,35)/b12-11+
NCI pathway
Reactome pathway
1.40E+3n/an/an/an/an/an/an/an/a
China Pharmaceutical University
Curated by ChEMBL
Assay Description
Mixed-type inhibition of human AChE using acetylthiocholine chloride as substrate incubated for 5 mins followed by substrate addition by Lineweaver-B...
Eur J Med Chem 157: 161-176 (2018)
Article DOI: 10.1016/j.ejmech.2018.08.005
BindingDB Entry DOI: 10.7270/Q29P34C1
Acetylcholinesterase
(Electrophorus electricus (Electric eel))
BDBM50469009
(CHEMBL4292766)
Show SMILES CC(C)(C)c1cc(\C=C\C(=O)NCCC2CCN(Cc3ccccc3F)CC2)cc(c1O)C(C)(C)C
Show InChI InChI=1S/C31H43FN2O2/c1-30(2,3)25-19-23(20-26(29(25)36)31(4,5)6)11-12-28(35)33-16-13-22-14-17-34(18-15-22)21-24-9-7-8-10-27(24)32/h7-12,19-20,22,36H,13-18,21H2,1-6H3,(H,33,35)/b12-11+
n/an/a 75n/an/an/an/an/an/a
China Pharmaceutical University
Curated by ChEMBL
Assay Description
Inhibition of electric eel AChE using acetylthiocholine chloride as substrate incubated for 5 mins followed by substrate addition measured after 180 ...
Eur J Med Chem 157: 161-176 (2018)
Article DOI: 10.1016/j.ejmech.2018.08.005
BindingDB Entry DOI: 10.7270/Q29P34C1
Amine oxidase [flavin-containing] B
(Homo sapiens (Human))
BDBM50469009
(CHEMBL4292766)
Show SMILES CC(C)(C)c1cc(\C=C\C(=O)NCCC2CCN(Cc3ccccc3F)CC2)cc(c1O)C(C)(C)C
Show InChI InChI=1S/C31H43FN2O2/c1-30(2,3)25-19-23(20-26(29(25)36)31(4,5)6)11-12-28(35)33-16-13-22-14-17-34(18-15-22)21-24-9-7-8-10-27(24)32/h7-12,19-20,22,36H,13-18,21H2,1-6H3,(H,33,35)/b12-11+
n/an/a 7.40E+3n/an/an/an/an/an/a
China Pharmaceutical University
Curated by ChEMBL
Assay Description
Inhibition of human MAO-B using p-tyramine as substrate incubated for 15 mins followed by substrate addition measured for 20 mins by fluorescence ass...
Eur J Med Chem 157: 161-176 (2018)
Article DOI: 10.1016/j.ejmech.2018.08.005
BindingDB Entry DOI: 10.7270/Q29P34C1
Amine oxidase [flavin-containing] A
(Homo sapiens (Human))
BDBM50469009
(CHEMBL4292766)
Show SMILES CC(C)(C)c1cc(\C=C\C(=O)NCCC2CCN(Cc3ccccc3F)CC2)cc(c1O)C(C)(C)C
Show InChI InChI=1S/C31H43FN2O2/c1-30(2,3)25-19-23(20-26(29(25)36)31(4,5)6)11-12-28(35)33-16-13-22-14-17-34(18-15-22)21-24-9-7-8-10-27(24)32/h7-12,19-20,22,36H,13-18,21H2,1-6H3,(H,33,35)/b12-11+
n/an/a 6.02E+4n/an/an/an/an/an/a
China Pharmaceutical University
Curated by ChEMBL
Assay Description
Inhibition of human MAO-A using p-tyramine as substrate incubated for 15 mins followed by substrate addition measured for 20 mins by fluorescence ass...
Eur J Med Chem 157: 161-176 (2018)
Article DOI: 10.1016/j.ejmech.2018.08.005
BindingDB Entry DOI: 10.7270/Q29P34C1
Acetylcholinesterase
(Homo sapiens (Human))
BDBM50469009
(CHEMBL4292766)
Show SMILES CC(C)(C)c1cc(\C=C\C(=O)NCCC2CCN(Cc3ccccc3F)CC2)cc(c1O)C(C)(C)C
Show InChI InChI=1S/C31H43FN2O2/c1-30(2,3)25-19-23(20-26(29(25)36)31(4,5)6)11-12-28(35)33-16-13-22-14-17-34(18-15-22)21-24-9-7-8-10-27(24)32/h7-12,19-20,22,36H,13-18,21H2,1-6H3,(H,33,35)/b12-11+
NCI pathway
Reactome pathway
n/an/a 750n/an/an/an/an/an/a
China Pharmaceutical University
Curated by ChEMBL
Assay Description
Inhibition of human erythrocyte AChE using acetylthiocholine chloride as substrate incubated for 5 mins followed by substrate addition measured after...
Eur J Med Chem 157: 161-176 (2018)
Article DOI: 10.1016/j.ejmech.2018.08.005
BindingDB Entry DOI: 10.7270/Q29P34C1