BDBM50476638 CHEMBL75389
SMILES: C(c1ccc(NC2=NCCN2)cc1)c1ccc(NC2=NCCN2)cc1
InChI Key: InChIKey=LWSVCEUUPRLOSZ-UHFFFAOYSA-N
Data: 1 KI  1 EC50
Activity Spreadsheet -- Enzyme Inhibition Constant Data from BindingDB
Found 2 hits for monomerid = 50476638
Trg + Lig
Ki
nM
ΔG°
kcal/mole
IC50
nM
Kd
nM
EC50/IC50
nM
koff
s-1
kon
M-1s-1
pHTemp
°C
Adrenergic receptor alpha-2
(Homo sapiens (Human))
BDBM50476638
(CHEMBL75389)
Show SMILES C(c1ccc(NC2=NCCN2)cc1)c1ccc(NC2=NCCN2)cc1 |t:6,20|
Show InChI InChI=1S/C19H22N6/c1-5-16(24-18-20-9-10-21-18)6-2-14(1)13-15-3-7-17(8-4-15)25-19-22-11-12-23-19/h1-8H,9-13H2,(H2,20,21,24)(H2,22,23,25)
1.60n/an/an/an/an/an/an/an/a
University of Dublin
Curated by ChEMBL
Assay Description
Displacement of [3H]RX821002 from adrenergic alpha2 receptor in human brain frontal cortex
J Med Chem 50: 4516-27 (2007)
Article DOI: 10.1021/jm070229q
BindingDB Entry DOI: 10.7270/Q2571FSN
Adrenergic receptor alpha-2
(Homo sapiens (Human))
BDBM50476638
(CHEMBL75389)
Show SMILES C(c1ccc(NC2=NCCN2)cc1)c1ccc(NC2=NCCN2)cc1 |t:6,20|
Show InChI InChI=1S/C19H22N6/c1-5-16(24-18-20-9-10-21-18)6-2-14(1)13-15-3-7-17(8-4-15)25-19-22-11-12-23-19/h1-8H,9-13H2,(H2,20,21,24)(H2,22,23,25)
n/an/an/an/a 166n/an/an/an/a
University of Dublin
Curated by ChEMBL
Assay Description
Agonist activity at human brain adrenergic alpha2 receptor by [35S]GTPgammaS binding assay
J Med Chem 50: 4516-27 (2007)
Article DOI: 10.1021/jm070229q
BindingDB Entry DOI: 10.7270/Q2571FSN