BDBM50476646 CHEMBL242839
SMILES: NC(=N)Nc1ccc2OCCOc2c1
InChI Key: InChIKey=SOBSYGGSAKHFRZ-UHFFFAOYSA-N
Data: 1 EC50
Activity Spreadsheet -- Enzyme Inhibition Constant Data from BindingDB
Found 1 hit for monomerid = 50476646
Trg + Lig
Ki
nM
ΔG°
kcal/mole
IC50
nM
Kd
nM
EC50/IC50
nM
koff
s-1
kon
M-1s-1
pHTemp
°C
Adrenergic receptor alpha-2
(Homo sapiens (Human))
BDBM50476646
(CHEMBL242839)
Show SMILES NC(=N)Nc1ccc2OCCOc2c1
Show InChI InChI=1S/C9H11N3O2/c10-9(11)12-6-1-2-7-8(5-6)14-4-3-13-7/h1-2,5H,3-4H2,(H4,10,11,12)
n/an/an/an/a 4.22E+4n/an/an/an/a
University of Dublin
Curated by ChEMBL
Assay Description
Agonist activity at human brain adrenergic alpha2 receptor by [35S]GTPgammaS binding assay
J Med Chem 50: 4516-27 (2007)
Article DOI: 10.1021/jm070229q
BindingDB Entry DOI: 10.7270/Q2571FSN