BDBM5048 5-Chloro-2-cyano-N-(5-isopropyl-3,4-dimethyl-1,3-thiazol-2(3H)-ylidene)benzenesulfonamide::5-chloro-2-cyano-N-[(2Z)-3,4-dimethyl-5-(propan-2-yl)-2,3-dihydro-1,3-thiazol-2-ylidene]benzene-1-sulfonamide::thiazolidenebenzenesulfonamide deriv. 10l
SMILES: CC(C)c1s\c(=N/S(=O)(=O)c2cc(Cl)ccc2C#N)n(C)c1C
InChI Key: InChIKey=KNILSOKXXYKGCE-SDXDJHTJSA-N
Data: 4 IC50
Activity Spreadsheet -- Enzyme Inhibition Constant Data from BindingDB
Found 4 hits for monomerid = 5048
Trg + Lig
Ki
nM
ΔG°
kcal/mole
IC50
nM
Kd
nM
EC50/IC50
nM
koff
s-1
kon
M-1s-1
pHTemp
°C
HIV-1 Reverse Transcriptase
(Human immunodeficiency virus type 1)
BDBM5048
(5-Chloro-2-cyano-N-(5-isopropyl-3,4-dimethyl-1,3-t...)
Show SMILES CC(C)c1s\c(=N/S(=O)(=O)c2cc(Cl)ccc2C#N)n(C)c1C
Show InChI InChI=1S/C15H16ClN3O2S2/c1-9(2)14-10(3)19(4)15(22-14)18-23(20,21)13-7-12(16)6-5-11(13)8-17/h5-7,9H,1-4H3/b18-15-
n/an/a 11n/an/an/an/an/an/a
Yamanouchi Pharmaceutical Co. Ltd
Assay Description
The IC50 of reverse transcriptase is the concentration that inhibits 50% of recombinant HIV-1 RT RNA-directed DNA polymerase activity in vitro.
Bioorg Med Chem 13: 949-61 (2005)
Article DOI: 10.1016/j.bmc.2004.11.045
BindingDB Entry DOI: 10.7270/Q2C53J1Z
Reverse Transcriptase
(Human immunodeficiency virus 1)
BDBM5048
(5-Chloro-2-cyano-N-(5-isopropyl-3,4-dimethyl-1,3-t...)
Show SMILES CC(C)c1s\c(=N/S(=O)(=O)c2cc(Cl)ccc2C#N)n(C)c1C
Show InChI InChI=1S/C15H16ClN3O2S2/c1-9(2)14-10(3)19(4)15(22-14)18-23(20,21)13-7-12(16)6-5-11(13)8-17/h5-7,9H,1-4H3/b18-15-
n/an/a 6.31E+3n/an/an/an/an/an/a
Korea Institute of Science and Technology
Curated by ChEMBL
Assay Description
Inhibition of HIV1 reverse transcriptase K103N mutant by HeLa-MAGI assay
Bioorg Med Chem Lett 18: 1181-94 (2008)
Article DOI: 10.1016/j.bmcl.2007.11.134
BindingDB Entry DOI: 10.7270/Q2NS0XPK
HIV-1 Reverse Transcriptase Mutant (Y181C)
(Human immunodeficiency virus type 1)
BDBM5048
(5-Chloro-2-cyano-N-(5-isopropyl-3,4-dimethyl-1,3-t...)
Show SMILES CC(C)c1s\c(=N/S(=O)(=O)c2cc(Cl)ccc2C#N)n(C)c1C
Show InChI InChI=1S/C15H16ClN3O2S2/c1-9(2)14-10(3)19(4)15(22-14)18-23(20,21)13-7-12(16)6-5-11(13)8-17/h5-7,9H,1-4H3/b18-15-
n/an/a 200n/an/an/an/an/an/a
Yamanouchi Pharmaceutical Co. Ltd
Assay Description
The IC50 of reverse transcriptase is the concentration that inhibits 50% of recombinant HIV-1 RT RNA-directed DNA polymerase activity in vitro.
Bioorg Med Chem 13: 949-61 (2005)
Article DOI: 10.1016/j.bmc.2004.11.045
BindingDB Entry DOI: 10.7270/Q2C53J1Z
HIV-1 Reverse Transcriptase Mutant (K103N)
(Human immunodeficiency virus type 1)
BDBM5048
(5-Chloro-2-cyano-N-(5-isopropyl-3,4-dimethyl-1,3-t...)
Show SMILES CC(C)c1s\c(=N/S(=O)(=O)c2cc(Cl)ccc2C#N)n(C)c1C
Show InChI InChI=1S/C15H16ClN3O2S2/c1-9(2)14-10(3)19(4)15(22-14)18-23(20,21)13-7-12(16)6-5-11(13)8-17/h5-7,9H,1-4H3/b18-15-
n/an/a 5.90E+3n/an/an/an/an/an/a
Yamanouchi Pharmaceutical Co. Ltd
Assay Description
The IC50 of reverse transcriptase is the concentration that inhibits 50% of recombinant HIV-1 RT RNA-directed DNA polymerase activity in vitro.
Bioorg Med Chem 13: 949-61 (2005)
Article DOI: 10.1016/j.bmc.2004.11.045
BindingDB Entry DOI: 10.7270/Q2C53J1Z