BDBM50482552 CHEMBL507260
SMILES: [H][C@]12C[C@@]3([H])[C@]4([H])CC[C@@]5([H])C[C@H](OC(C)=O)[C@H](O)C[C@]5(C)[C@@]4([H])[C@@H](O)C[C@]3(C)[C@@]1([H])[C@@](C)(O)[C@]1(C[C@H](C)C(C)(C)O1)O2
InChI Key: InChIKey=CLRGSPLGNCTOOL-YKVVPRMGSA-N
Data: 1 IC50
Activity Spreadsheet -- Enzyme Inhibition Constant Data from BindingDB
Found 1 hit for monomerid = 50482552
Trg + Lig
Ki
nM
ΔG°
kcal/mole
IC50
nM
Kd
nM
EC50/IC50
nM
koff
s-1
kon
M-1s-1
pHTemp
°C
Eukaryotic initiation factor 4A-I
(Homo sapiens (Human))
BDBM50482552
(CHEMBL507260)
Show SMILES [H][C@]12C[C@@]3([H])[C@]4([H])CC[C@@]5([H])C[C@H](OC(C)=O)[C@H](O)C[C@]5(C)[C@@]4([H])[C@@H](O)C[C@]3(C)[C@@]1([H])[C@@](C)(O)[C@]1(C[C@H](C)C(C)(C)O1)O2 |r|
Show InChI InChI=1S/C30H48O7/c1-15-12-30(37-26(15,3)4)29(7,34)25-23(36-30)11-19-18-9-8-17-10-22(35-16(2)31)20(32)13-27(17,5)24(18)21(33)14-28(19,25)6/h15,17-25,32-34H,8-14H2,1-7H3/t15-,17-,18-,19-,20+,21-,22-,23-,24+,25-,27-,28-,29+,30+/m0/s1
Reactome pathway
n/an/a 1.70E+3n/an/an/an/an/an/a
McGill University
Curated by ChEMBL
Assay Description
Inhibition of eIF4A-mediated cap-dependent protein synthesis in FF-HCV-Ren mRNA transfected Swiss mouse Krebs2 cell extract by [35S]methionine metabo...
Nat Chem Biol 2: 213-20 (2006)
Article DOI: 10.1038/nchembio776
BindingDB Entry DOI: 10.7270/Q2F47RZB