BDBM50482565 CHEMBL1221511
SMILES: [H][C@]12C[C@@]3([H])[C@]4([H])CC[C@@]5([H])C[C@H](O)[C@@H](C[C@]5(C)[C@@]4([H])[C@@H](O)C[C@]3(C)[C@@]1([H])[C@@](C)(O)[C@@]1(C[C@H](C)C(C)(C)O1)O2)OC(=O)CCCC(O)=O
InChI Key: InChIKey=VHVPOWPLZYOWAX-DBRGUQOTSA-N
Data: 1 IC50
Activity Spreadsheet -- Enzyme Inhibition Constant Data from BindingDB
Found 1 hit for monomerid = 50482565
Trg + Lig
Ki
nM
ΔG°
kcal/mole
IC50
nM
Kd
nM
EC50/IC50
nM
koff
s-1
kon
M-1s-1
pHTemp
°C
Eukaryotic initiation factor 4A-I
(Homo sapiens (Human))
BDBM50482565
(CHEMBL1221511)
Show SMILES [H][C@]12C[C@@]3([H])[C@]4([H])CC[C@@]5([H])C[C@H](O)[C@@H](C[C@]5(C)[C@@]4([H])[C@@H](O)C[C@]3(C)[C@@]1([H])[C@@](C)(O)[C@@]1(C[C@H](C)C(C)(C)O1)O2)OC(=O)CCCC(O)=O |r|
Show InChI InChI=1S/C33H52O9/c1-17-14-33(42-29(17,2)3)32(6,39)28-23(41-33)13-20-19-11-10-18-12-21(34)24(40-26(38)9-7-8-25(36)37)16-30(18,4)27(19)22(35)15-31(20,28)5/h17-24,27-28,34-35,39H,7-16H2,1-6H3,(H,36,37)/t17-,18-,19-,20-,21-,22-,23-,24+,27+,28-,30-,31-,32+,33-/m0/s1
Reactome pathway
n/an/a 3.50E+4n/an/an/an/an/an/a
McGill University
Curated by ChEMBL
Assay Description
Inhibition of eIF4A-mediated cap-dependent protein synthesis in FF-HCV-Ren mRNA transfected Swiss mouse Krebs2 cell extract by [35S]methionine metabo...
Nat Chem Biol 2: 213-20 (2006)
Article DOI: 10.1038/nchembio776
BindingDB Entry DOI: 10.7270/Q2F47RZB