null
SMILES: CCOc1ccccc1-c1ccc2nc(NC(=O)NCCN3CCNCC3)sc2c1
InChI Key: InChIKey=DZDUTNLSSQXEMT-UHFFFAOYSA-N
Activity Spreadsheet -- Enzyme Inhibition Constant Data from BindingDB
Found 1 hit for monomerid = 50490932
Trg + Lig
Ki
nM
ΔG°
kcal/mole
IC50
nM
Kd
nM
EC50/IC50
nM
koff
s-1
kon
M-1s-1
pHTemp
°C
Tyrosine-protein kinase ABL1
(Homo sapiens (Human))
BDBM50490932
(CHEMBL2347729)
Show SMILES CCOc1ccccc1-c1ccc2nc(NC(=O)NCCN3CCNCC3)sc2c1
Show InChI InChI=1S/C22H27N5O2S/c1-2-29-19-6-4-3-5-17(19)16-7-8-18-20(15-16)30-22(25-18)26-21(28)24-11-14-27-12-9-23-10-13-27/h3-8,15,23H,2,9-14H2,1H3,(H2,24,25,26,28)
Reactome pathway
n/an/a 0.120n/an/an/an/an/an/a
Korea Institute of Science and Technology (KAIST)
Curated by ChEMBL
Assay Description
Inhibition of breakpoint cluster region-Abelson tyrosine kinase T315I mutant (unknown origin) using [gamma-33P]ATP as substrate by radiometric kinase...
J Med Chem 56: 3531-45 (2013)
Article DOI: 10.1021/jm301891t
BindingDB Entry DOI: 10.7270/Q2BG2RW2