null
SMILES: CCCS(=O)(=O)Nc1cccc(Oc2ccc3ncn(C)c(=O)c3c2)c1C#N
InChI Key: InChIKey=VGRFMKOMSOFTRW-UHFFFAOYSA-N
Activity Spreadsheet -- Enzyme Inhibition Constant Data from BindingDB
Found 2 hits for monomerid = 50496948
Trg + Lig
Ki
nM
ΔG°
kcal/mole
IC50
nM
Kd
nM
EC50/IC50
nM
koff
s-1
kon
M-1s-1
pHTemp
°C
Serine/threonine-protein kinase B-raf
(Homo sapiens (Human))
BDBM50496948
(CHEMBL3236472)
Show SMILES CCCS(=O)(=O)Nc1cccc(Oc2ccc3ncn(C)c(=O)c3c2)c1C#N
Show InChI InChI=1S/C19H18N4O4S/c1-3-9-28(25,26)22-17-5-4-6-18(15(17)11-20)27-13-7-8-16-14(10-13)19(24)23(2)12-21-16/h4-8,10,12,22H,3,9H2,1-2H3
NCI pathway
Reactome pathway
n/an/a 0.300n/an/an/an/an/an/a
Array BioPharma, Inc.
Curated by ChEMBL
Assay Description
Inhibition of full-length B-Raf V600E mutant (unknown origin)
Bioorg Med Chem Lett 24: 1923-7 (2014)
Article DOI: 10.1016/j.bmcl.2014.03.007
BindingDB Entry DOI: 10.7270/Q2Q24368
Serine/threonine-protein kinase B-raf
(Homo sapiens (Human))
BDBM50496948
(CHEMBL3236472)
Show SMILES CCCS(=O)(=O)Nc1cccc(Oc2ccc3ncn(C)c(=O)c3c2)c1C#N
Show InChI InChI=1S/C19H18N4O4S/c1-3-9-28(25,26)22-17-5-4-6-18(15(17)11-20)27-13-7-8-16-14(10-13)19(24)23(2)12-21-16/h4-8,10,12,22H,3,9H2,1-2H3
NCI pathway
Reactome pathway
n/an/a 7n/an/an/an/an/an/a
Array BioPharma, Inc.
Curated by ChEMBL
Assay Description
Inhibition of B-Raf V600E mutant in human Malme-3M cells assessed as basal ERK phosphorylation
Bioorg Med Chem Lett 24: 1923-7 (2014)
Article DOI: 10.1016/j.bmcl.2014.03.007
BindingDB Entry DOI: 10.7270/Q2Q24368