BDBM50498060 CHEMBL3394249
SMILES: CS(=O)(=O)c1cc([nH]c(=O)c1C#N)-c1cccc(OCc2cccc(Cl)c2)c1
InChI Key: InChIKey=PWYFUIDWXINIRW-UHFFFAOYSA-N
Data: 1 IC50
Activity Spreadsheet -- Enzyme Inhibition Constant Data from BindingDB
Found 1 hit for monomerid = 50498060
Trg + Lig
Ki
nM
ΔG°
kcal/mole
IC50
nM
Kd
nM
EC50/IC50
nM
koff
s-1
kon
M-1s-1
pHTemp
°C
Thymidylate kinase
(Mycobacterium tuberculosis)
BDBM50498060
(CHEMBL3394249)
Show SMILES CS(=O)(=O)c1cc([nH]c(=O)c1C#N)-c1cccc(OCc2cccc(Cl)c2)c1
Show InChI InChI=1S/C20H15ClN2O4S/c1-28(25,26)19-10-18(23-20(24)17(19)11-22)14-5-3-7-16(9-14)27-12-13-4-2-6-15(21)8-13/h2-10H,12H2,1H3,(H,23,24)
n/an/a 22n/an/an/an/an/an/a
AstraZeneca
Curated by ChEMBL
Assay Description
Inhibition of Mycobacterium tuberculosis thymidylate kinase activity by pyruvate kinase-lactate dehydrogenase coupled assay
J Med Chem 58: 753-66 (2015)
Article DOI: 10.1021/jm5012947
BindingDB Entry DOI: 10.7270/Q2JS9TD7