BDBM50498062 CHEMBL3394246
SMILES: C[S+]([O-])c1cc([nH]c(=O)c1C#N)-c1cccc(Br)c1
InChI Key: InChIKey=QETJHOPFWPBRAB-UHFFFAOYSA-N
Data: 1 IC50
Activity Spreadsheet -- Enzyme Inhibition Constant Data from BindingDB
Found 1 hit for monomerid = 50498062
Trg + Lig
Ki
nM
ΔG°
kcal/mole
IC50
nM
Kd
nM
EC50/IC50
nM
koff
s-1
kon
M-1s-1
pHTemp
°C
Thymidylate kinase
(Mycobacterium tuberculosis)
BDBM50498062
(CHEMBL3394246)
Show SMILES C[S+]([O-])c1cc([nH]c(=O)c1C#N)-c1cccc(Br)c1
Show InChI InChI=1S/C13H9BrN2O2S/c1-19(18)12-6-11(16-13(17)10(12)7-15)8-3-2-4-9(14)5-8/h2-6H,1H3,(H,16,17)
n/an/a 140n/an/an/an/an/an/a
AstraZeneca
Curated by ChEMBL
Assay Description
Inhibition of Mycobacterium tuberculosis thymidylate kinase activity by pyruvate kinase-lactate dehydrogenase coupled assay
J Med Chem 58: 753-66 (2015)
Article DOI: 10.1021/jm5012947
BindingDB Entry DOI: 10.7270/Q2JS9TD7