BDBM50498092 CHEMBL3394252
SMILES: CS(=O)(=O)c1c2COc3ccccc3-c2[nH]c(=O)c1C#N
InChI Key: InChIKey=PRPIBIZXJYYOPY-UHFFFAOYSA-N
Data: 1 IC50
Activity Spreadsheet -- Enzyme Inhibition Constant Data from BindingDB
Found 1 hit for monomerid = 50498092
Trg + Lig
Ki
nM
ΔG°
kcal/mole
IC50
nM
Kd
nM
EC50/IC50
nM
koff
s-1
kon
M-1s-1
pHTemp
°C
Thymidylate kinase
(Mycobacterium tuberculosis)
BDBM50498092
(CHEMBL3394252)
Show SMILES CS(=O)(=O)c1c2COc3ccccc3-c2[nH]c(=O)c1C#N
Show InChI InChI=1S/C14H10N2O4S/c1-21(18,19)13-9(6-15)14(17)16-12-8-4-2-3-5-11(8)20-7-10(12)13/h2-5H,7H2,1H3,(H,16,17)
n/an/a 3.00E+4n/an/an/an/an/an/a
AstraZeneca
Curated by ChEMBL
Assay Description
Inhibition of Mycobacterium tuberculosis thymidylate kinase activity by pyruvate kinase-lactate dehydrogenase coupled assay
J Med Chem 58: 753-66 (2015)
Article DOI: 10.1021/jm5012947
BindingDB Entry DOI: 10.7270/Q2JS9TD7