BDBM50498094 CHEMBL3394154
SMILES: COc1cccc(c1)-c1cc(-c2cccc(N)c2)c(C#N)c(=O)[nH]1
InChI Key: InChIKey=QBRRELDRSUBUHI-UHFFFAOYSA-N
Data: 1 IC50
Activity Spreadsheet -- Enzyme Inhibition Constant Data from BindingDB
Found 1 hit for monomerid = 50498094
Trg + Lig
Ki
nM
ΔG°
kcal/mole
IC50
nM
Kd
nM
EC50/IC50
nM
koff
s-1
kon
M-1s-1
pHTemp
°C
Thymidylate kinase
(Mycobacterium tuberculosis)
BDBM50498094
(CHEMBL3394154)
Show SMILES COc1cccc(c1)-c1cc(-c2cccc(N)c2)c(C#N)c(=O)[nH]1
Show InChI InChI=1S/C19H15N3O2/c1-24-15-7-3-5-13(9-15)18-10-16(17(11-20)19(23)22-18)12-4-2-6-14(21)8-12/h2-10H,21H2,1H3,(H,22,23)
n/an/a 1.20E+3n/an/an/an/an/an/a
AstraZeneca
Curated by ChEMBL
Assay Description
Inhibition of Mycobacterium tuberculosis thymidylate kinase activity by pyruvate kinase-lactate dehydrogenase coupled assay
J Med Chem 58: 753-66 (2015)
Article DOI: 10.1021/jm5012947
BindingDB Entry DOI: 10.7270/Q2JS9TD7