null
SMILES: CNC(=O)c1cc2c(ccc3c(C)cc(=O)oc23)oc1=N
InChI Key: InChIKey=QIGYMOQNNAMNRB-UHFFFAOYSA-N
Activity Spreadsheet -- Enzyme Inhibition Constant Data from BindingDB
Found 2 hits for monomerid = 50500454
Trg + Lig
Ki
nM
ΔG°
kcal/mole
IC50
nM
Kd
nM
EC50/IC50
nM
koff
s-1
kon
M-1s-1
pHTemp
°C
Cholinesterase
(Equus caballus (Horse))
BDBM50500454
(CHEMBL3746327)
Show SMILES CNC(=O)c1cc2c(ccc3c(C)cc(=O)oc23)oc1=N
Show InChI InChI=1S/C15H12N2O4/c1-7-5-12(18)21-13-8(7)3-4-11-9(13)6-10(14(16)20-11)15(19)17-2/h3-6,16H,1-2H3,(H,17,19)
n/an/a>1.00E+5n/an/an/an/an/an/a
Yogi Vemana University
Curated by ChEMBL
Assay Description
Inhibition of horse serum butyrylcholinesterase using butyrylthiocholine iodide as substrate preincubated for 5 mins followed by substrate addition m...
Eur J Med Chem 107: 219-32 (2016)
Article DOI: 10.1016/j.ejmech.2015.10.046
BindingDB Entry DOI: 10.7270/Q2JW8HWF
Acetylcholinesterase
(Electrophorus electricus (Electric eel))
BDBM50500454
(CHEMBL3746327)
Show SMILES CNC(=O)c1cc2c(ccc3c(C)cc(=O)oc23)oc1=N
Show InChI InChI=1S/C15H12N2O4/c1-7-5-12(18)21-13-8(7)3-4-11-9(13)6-10(14(16)20-11)15(19)17-2/h3-6,16H,1-2H3,(H,17,19)
n/an/a 1.40E+3n/an/an/an/an/an/a
Yogi Vemana University
Curated by ChEMBL
Assay Description
Inhibition of electric eel AChE using acetylthiocholine iodide as substrate preincubated for 5 mins followed by substrate addition measured after 5 m...
Eur J Med Chem 107: 219-32 (2016)
Article DOI: 10.1016/j.ejmech.2015.10.046
BindingDB Entry DOI: 10.7270/Q2JW8HWF