BDBM50503793 CHEMBL4461481
SMILES: Cc1cc(C)n(NC(=O)C2CN(C(=O)C2)c2cc(C)c(c(C)c2Cl)S(N)(=O)=O)n1
InChI Key: InChIKey=SQIXPRUJAUUIMS-UHFFFAOYSA-N
Data: 16 Kd
Activity Spreadsheet -- Enzyme Inhibition Constant Data from BindingDB
Found 16 hits for monomerid = 50503793
Trg + Lig
Ki
nM
ΔG°
kcal/mole
IC50
nM
Kd
nM
EC50/IC50
nM
koff
s-1
kon
M-1s-1
pHTemp
°C
Carbonic anhydrase
(Homo sapiens (Human))
BDBM50503793
(CHEMBL4461481)
Show SMILES Cc1cc(C)n(NC(=O)C2CN(C(=O)C2)c2cc(C)c(c(C)c2Cl)S(N)(=O)=O)n1
Show InChI InChI=1S/C18H22ClN5O4S/c1-9-5-14(16(19)12(4)17(9)29(20,27)28)23-8-13(7-15(23)25)18(26)22-24-11(3)6-10(2)21-24/h5-6,13H,7-8H2,1-4H3,(H,22,26)(H2,20,27,28)
n/an/an/a 0.0110n/an/an/an/an/a
Kaunas University of Technology
Curated by ChEMBL
Assay Description
Binding affinity to recombinant human CA13 assessed as intrinsic dissociation constant by DSF-based fluorescence thermal shift assay
Bioorg Med Chem 27: 322-337 (2019)
Article DOI: 10.1016/j.bmc.2018.12.011
Carbonic anhydrase
(Homo sapiens (Human))
BDBM50503793
(CHEMBL4461481)
Show SMILES Cc1cc(C)n(NC(=O)C2CN(C(=O)C2)c2cc(C)c(c(C)c2Cl)S(N)(=O)=O)n1
Show InChI InChI=1S/C18H22ClN5O4S/c1-9-5-14(16(19)12(4)17(9)29(20,27)28)23-8-13(7-15(23)25)18(26)22-24-11(3)6-10(2)21-24/h5-6,13H,7-8H2,1-4H3,(H,22,26)(H2,20,27,28)
Reactome pathway
n/an/an/a 0.0120n/an/an/an/an/a
Kaunas University of Technology
Curated by ChEMBL
Assay Description
Binding affinity to recombinant human CA7 assessed as intrinsic dissociation constant by DSF-based fluorescence thermal shift assay
Bioorg Med Chem 27: 322-337 (2019)
Article DOI: 10.1016/j.bmc.2018.12.011
Carbonic anhydrase
(Homo sapiens (Human))
BDBM50503793
(CHEMBL4461481)
Show SMILES Cc1cc(C)n(NC(=O)C2CN(C(=O)C2)c2cc(C)c(c(C)c2Cl)S(N)(=O)=O)n1
Show InChI InChI=1S/C18H22ClN5O4S/c1-9-5-14(16(19)12(4)17(9)29(20,27)28)23-8-13(7-15(23)25)18(26)22-24-11(3)6-10(2)21-24/h5-6,13H,7-8H2,1-4H3,(H,22,26)(H2,20,27,28)
n/an/an/a 0.380n/an/an/an/an/a
Kaunas University of Technology
Curated by ChEMBL
Assay Description
Binding affinity to recombinant human CA6 assessed as intrinsic dissociation constant by DSF-based fluorescence thermal shift assay
Bioorg Med Chem 27: 322-337 (2019)
Article DOI: 10.1016/j.bmc.2018.12.011
Carbonic anhydrases; II & IX
(Homo sapiens (Human))
BDBM50503793
(CHEMBL4461481)
Show SMILES Cc1cc(C)n(NC(=O)C2CN(C(=O)C2)c2cc(C)c(c(C)c2Cl)S(N)(=O)=O)n1
Show InChI InChI=1S/C18H22ClN5O4S/c1-9-5-14(16(19)12(4)17(9)29(20,27)28)23-8-13(7-15(23)25)18(26)22-24-11(3)6-10(2)21-24/h5-6,13H,7-8H2,1-4H3,(H,22,26)(H2,20,27,28)
NCI pathway
Reactome pathway
n/an/an/a 0.0350n/an/an/an/an/a
Kaunas University of Technology
Curated by ChEMBL
Assay Description
Binding affinity to recombinant human CA9 assessed as intrinsic dissociation constant by DSF-based fluorescence thermal shift assay
Bioorg Med Chem 27: 322-337 (2019)
Article DOI: 10.1016/j.bmc.2018.12.011
Carbonic anhydrase
(Homo sapiens (Human))
BDBM50503793
(CHEMBL4461481)
Show SMILES Cc1cc(C)n(NC(=O)C2CN(C(=O)C2)c2cc(C)c(c(C)c2Cl)S(N)(=O)=O)n1
Show InChI InChI=1S/C18H22ClN5O4S/c1-9-5-14(16(19)12(4)17(9)29(20,27)28)23-8-13(7-15(23)25)18(26)22-24-11(3)6-10(2)21-24/h5-6,13H,7-8H2,1-4H3,(H,22,26)(H2,20,27,28)
Reactome pathway
n/an/an/a 0.960n/an/an/an/an/a
Kaunas University of Technology
Curated by ChEMBL
Assay Description
Binding affinity to recombinant human CA12 assessed as intrinsic dissociation constant by DSF-based fluorescence thermal shift assay
Bioorg Med Chem 27: 322-337 (2019)
Article DOI: 10.1016/j.bmc.2018.12.011
Carbonic anhydrase
(Homo sapiens (Human))
BDBM50503793
(CHEMBL4461481)
Show SMILES Cc1cc(C)n(NC(=O)C2CN(C(=O)C2)c2cc(C)c(c(C)c2Cl)S(N)(=O)=O)n1
Show InChI InChI=1S/C18H22ClN5O4S/c1-9-5-14(16(19)12(4)17(9)29(20,27)28)23-8-13(7-15(23)25)18(26)22-24-11(3)6-10(2)21-24/h5-6,13H,7-8H2,1-4H3,(H,22,26)(H2,20,27,28)
NCI pathway
Reactome pathway
n/an/an/a 1.30n/an/an/an/an/a
Kaunas University of Technology
Curated by ChEMBL
Assay Description
Binding affinity to recombinant human CA1 assessed as intrinsic dissociation constant by DSF-based fluorescence thermal shift assay
Bioorg Med Chem 27: 322-337 (2019)
Article DOI: 10.1016/j.bmc.2018.12.011
Carbonic anhydrase 2
(Homo sapiens (Human))
BDBM50503793
(CHEMBL4461481)
Show SMILES Cc1cc(C)n(NC(=O)C2CN(C(=O)C2)c2cc(C)c(c(C)c2Cl)S(N)(=O)=O)n1
Show InChI InChI=1S/C18H22ClN5O4S/c1-9-5-14(16(19)12(4)17(9)29(20,27)28)23-8-13(7-15(23)25)18(26)22-24-11(3)6-10(2)21-24/h5-6,13H,7-8H2,1-4H3,(H,22,26)(H2,20,27,28)
Reactome pathway
n/an/an/a 0.0110n/an/an/an/an/a
Kaunas University of Technology
Curated by ChEMBL
Assay Description
Binding affinity to recombinant human CA2 assessed as intrinsic dissociation constant by DSF-based fluorescence thermal shift assay
Bioorg Med Chem 27: 322-337 (2019)
Article DOI: 10.1016/j.bmc.2018.12.011
Carbonic anhydrase V
(Homo sapiens (Human))
BDBM50503793
(CHEMBL4461481)
Show SMILES Cc1cc(C)n(NC(=O)C2CN(C(=O)C2)c2cc(C)c(c(C)c2Cl)S(N)(=O)=O)n1
Show InChI InChI=1S/C18H22ClN5O4S/c1-9-5-14(16(19)12(4)17(9)29(20,27)28)23-8-13(7-15(23)25)18(26)22-24-11(3)6-10(2)21-24/h5-6,13H,7-8H2,1-4H3,(H,22,26)(H2,20,27,28)
Reactome pathway
n/an/an/a 0.0620n/an/an/an/an/a
Kaunas University of Technology
Curated by ChEMBL
Assay Description
Binding affinity to recombinant full length N-terminal His6x-tagged human CA5B expressed in Escherichia coli Rosetta 2 (DE3) assessed as intrinsic di...
Bioorg Med Chem 27: 322-337 (2019)
Article DOI: 10.1016/j.bmc.2018.12.011
Carbonic anhydrase
(Homo sapiens (Human))
BDBM50503793
(CHEMBL4461481)
Show SMILES Cc1cc(C)n(NC(=O)C2CN(C(=O)C2)c2cc(C)c(c(C)c2Cl)S(N)(=O)=O)n1
Show InChI InChI=1S/C18H22ClN5O4S/c1-9-5-14(16(19)12(4)17(9)29(20,27)28)23-8-13(7-15(23)25)18(26)22-24-11(3)6-10(2)21-24/h5-6,13H,7-8H2,1-4H3,(H,22,26)(H2,20,27,28)
Reactome pathway
n/an/an/a 2.00E+3n/an/an/an/an/a
Kaunas University of Technology
Curated by ChEMBL
Assay Description
Binding affinity to recombinant human CA12 by DSF-based fluorescence thermal shift assay
Bioorg Med Chem 27: 322-337 (2019)
Article DOI: 10.1016/j.bmc.2018.12.011
Carbonic anhydrase 2
(Homo sapiens (Human))
BDBM50503793
(CHEMBL4461481)
Show SMILES Cc1cc(C)n(NC(=O)C2CN(C(=O)C2)c2cc(C)c(c(C)c2Cl)S(N)(=O)=O)n1
Show InChI InChI=1S/C18H22ClN5O4S/c1-9-5-14(16(19)12(4)17(9)29(20,27)28)23-8-13(7-15(23)25)18(26)22-24-11(3)6-10(2)21-24/h5-6,13H,7-8H2,1-4H3,(H,22,26)(H2,20,27,28)
Reactome pathway
n/an/an/a 20n/an/an/an/an/a
Kaunas University of Technology
Curated by ChEMBL
Assay Description
Binding affinity to recombinant human CA2 by DSF-based fluorescence thermal shift assay
Bioorg Med Chem 27: 322-337 (2019)
Article DOI: 10.1016/j.bmc.2018.12.011
Carbonic anhydrase
(Homo sapiens (Human))
BDBM50503793
(CHEMBL4461481)
Show SMILES Cc1cc(C)n(NC(=O)C2CN(C(=O)C2)c2cc(C)c(c(C)c2Cl)S(N)(=O)=O)n1
Show InChI InChI=1S/C18H22ClN5O4S/c1-9-5-14(16(19)12(4)17(9)29(20,27)28)23-8-13(7-15(23)25)18(26)22-24-11(3)6-10(2)21-24/h5-6,13H,7-8H2,1-4H3,(H,22,26)(H2,20,27,28)
NCI pathway
Reactome pathway
n/an/an/a 1.10E+3n/an/an/an/an/a
Kaunas University of Technology
Curated by ChEMBL
Assay Description
Binding affinity to recombinant human CA1 by DSF-based fluorescence thermal shift assay
Bioorg Med Chem 27: 322-337 (2019)
Article DOI: 10.1016/j.bmc.2018.12.011
Carbonic anhydrase
(Homo sapiens (Human))
BDBM50503793
(CHEMBL4461481)
Show SMILES Cc1cc(C)n(NC(=O)C2CN(C(=O)C2)c2cc(C)c(c(C)c2Cl)S(N)(=O)=O)n1
Show InChI InChI=1S/C18H22ClN5O4S/c1-9-5-14(16(19)12(4)17(9)29(20,27)28)23-8-13(7-15(23)25)18(26)22-24-11(3)6-10(2)21-24/h5-6,13H,7-8H2,1-4H3,(H,22,26)(H2,20,27,28)
n/an/an/a 3.30E+3n/an/an/an/an/a
Kaunas University of Technology
Curated by ChEMBL
Assay Description
Binding affinity to recombinant human CA6 by DSF-based fluorescence thermal shift assay
Bioorg Med Chem 27: 322-337 (2019)
Article DOI: 10.1016/j.bmc.2018.12.011
Carbonic anhydrase V
(Homo sapiens (Human))
BDBM50503793
(CHEMBL4461481)
Show SMILES Cc1cc(C)n(NC(=O)C2CN(C(=O)C2)c2cc(C)c(c(C)c2Cl)S(N)(=O)=O)n1
Show InChI InChI=1S/C18H22ClN5O4S/c1-9-5-14(16(19)12(4)17(9)29(20,27)28)23-8-13(7-15(23)25)18(26)22-24-11(3)6-10(2)21-24/h5-6,13H,7-8H2,1-4H3,(H,22,26)(H2,20,27,28)
Reactome pathway
n/an/an/a 100n/an/an/an/an/a
Kaunas University of Technology
Curated by ChEMBL
Assay Description
Binding affinity to recombinant full length N-terminal His6x-tagged human CA5B expressed in Escherichia coli Rosetta 2 (DE3) by DSF-based fluorescenc...
Bioorg Med Chem 27: 322-337 (2019)
Article DOI: 10.1016/j.bmc.2018.12.011
Carbonic anhydrase
(Homo sapiens (Human))
BDBM50503793
(CHEMBL4461481)
Show SMILES Cc1cc(C)n(NC(=O)C2CN(C(=O)C2)c2cc(C)c(c(C)c2Cl)S(N)(=O)=O)n1
Show InChI InChI=1S/C18H22ClN5O4S/c1-9-5-14(16(19)12(4)17(9)29(20,27)28)23-8-13(7-15(23)25)18(26)22-24-11(3)6-10(2)21-24/h5-6,13H,7-8H2,1-4H3,(H,22,26)(H2,20,27,28)
n/an/an/a 10n/an/an/an/an/a
Kaunas University of Technology
Curated by ChEMBL
Assay Description
Binding affinity to recombinant human CA13 by DSF-based fluorescence thermal shift assay
Bioorg Med Chem 27: 322-337 (2019)
Article DOI: 10.1016/j.bmc.2018.12.011
Carbonic anhydrases; II & IX
(Homo sapiens (Human))
BDBM50503793
(CHEMBL4461481)
Show SMILES Cc1cc(C)n(NC(=O)C2CN(C(=O)C2)c2cc(C)c(c(C)c2Cl)S(N)(=O)=O)n1
Show InChI InChI=1S/C18H22ClN5O4S/c1-9-5-14(16(19)12(4)17(9)29(20,27)28)23-8-13(7-15(23)25)18(26)22-24-11(3)6-10(2)21-24/h5-6,13H,7-8H2,1-4H3,(H,22,26)(H2,20,27,28)
NCI pathway
Reactome pathway
n/an/an/a 100n/an/an/an/an/a
Kaunas University of Technology
Curated by ChEMBL
Assay Description
Binding affinity to recombinant human CA9 by DSF-based fluorescence thermal shift assay
Bioorg Med Chem 27: 322-337 (2019)
Article DOI: 10.1016/j.bmc.2018.12.011
Carbonic anhydrase
(Homo sapiens (Human))
BDBM50503793
(CHEMBL4461481)
Show SMILES Cc1cc(C)n(NC(=O)C2CN(C(=O)C2)c2cc(C)c(c(C)c2Cl)S(N)(=O)=O)n1
Show InChI InChI=1S/C18H22ClN5O4S/c1-9-5-14(16(19)12(4)17(9)29(20,27)28)23-8-13(7-15(23)25)18(26)22-24-11(3)6-10(2)21-24/h5-6,13H,7-8H2,1-4H3,(H,22,26)(H2,20,27,28)
Reactome pathway
n/an/an/a 25n/an/an/an/an/a
Kaunas University of Technology
Curated by ChEMBL
Assay Description
Binding affinity to recombinant human CA7 by DSF-based fluorescence thermal shift assay
Bioorg Med Chem 27: 322-337 (2019)
Article DOI: 10.1016/j.bmc.2018.12.011